{"text_format":"1","workbook":"xlsx","n_sheets":9,"sheets":["Sheet1","Sheet4","Sheet10","1E-S","2E-S","3E-S","4E-S","5E-S","6E-S"],"not_rendered":{"charts":0,"images":3,"macros":1,"external_links":0,"defined_names":0,"comments":0,"pivot_tables":0},"unopened":[],"bounds":{"document_bytes":16777216,"sheet_cells":100000,"rows_first":2000,"rows_last":500,"rows_between":2000,"halvings":0,"cell_chars":16384,"cell_head_chars":4096},"cells_cut":0,"cells_raw":0,"read":"whole","date_system":"1900"}

{"sheet":"Sheet1","index":0,"n_rows":42,"n_cols":7,"rows_kept":42,"cut":false,"hidden":false,"merged":[[33,1,33,4],[30,1,30,2],[31,1,31,2],[28,4,28,5],[31,4,31,5],[25,1,25,2],[26,1,26,2],[27,1,27,2],[28,1,28,2],[29,1,29,2],[20,1,20,2],[21,1,21,2],[22,1,22,2],[23,1,23,2],[24,1,24,2],[18,1,18,2],[18,3,18,4],[12,1,12,2],[12,3,12,4],[14,1,14,2],[14,3,14,4],[16,3,16,4],[16,1,16,2],[1,1,2,4],[3,1,3,2],[4,1,4,2],[4,3,4,4],[10,1,10,2],[10,3,10,4],[6,1,6,2],[6,3,6,4],[8,1,8,2],[8,3,8,4]]}
[]
[null,"FACT CTU SELECTION WIZARD for Splice/patch FACT Elements"]
[]
[null,"Select"]
[null,"Frame type"]
[]
[null,{"$f":"Sheet4!C8","v":"…"}]
[]
[null,{"$f":"Sheet4!C12","v":"…"}]
[]
[null,{"$f":"Sheet4!C18","v":"…"}]
[]
[null,{"$f":"Sheet4!C19","v":"…"},null,null,null,null,"FACT-FRACCCTU4E"]
[]
[null,{"$f":"Sheet4!C30","v":"…"}]
[]
[null,{"$f":"Sheet4!C31","v":"…"}]
[]
[null,{"$f":"Sheet4!C47","v":"…"}]
[]
[null,"FACT-FRACCCTU1E  MID 760243102",null,{"$f":"Sheet4!E27","v":"nok"}]
[null,"FACT-FRACCCTU2E  MID 760243103",null,{"$f":"Sheet4!E28","v":"nok"}]
[null,"FACT-FRACCCTU3E  MID 760243104",null,{"$f":"Sheet4!E29","v":"nok"},null,null,"FACT-ACCCTUMLT"]
[null,"FACT-FRACCCTU4E  MID 760243105",null,{"$f":"Sheet4!E30","v":"nok"}]
[null,"FACT-FRACCCTU5E  MID 760243106",null,{"$f":"Sheet4!E31","v":"nok"}]
[null,"FACT-FRACCCTU6E  MID 760243107",null,{"$f":"Sheet4!E32","v":"nok"}]
[null,"FACT-ACCCTU6x7mm  MID 760249062",null,{"$f":"Sheet4!E33","v":"nok"}]
[null,"FACT-ACCCTUSLT  MID 760239952",null,{"$f":"Sheet4!E34","v":"nok"}]
[null,"FACT-ACCCTUMLT  MID 760239898",null,{"$f":"Sheet4!E35","v":"nok"},{"$f":"IF(Sheet4!E35=Sheet4!F2,Sheet4!E2,\"\")","v":""}]
[null,"FACT-ACCCTULLT  MID 760239897",null,{"$f":"Sheet4!E36","v":"nok"}]
[null,"FACT-ACCCTUSIFC  MID 760239951",null,{"$f":"Sheet4!E37","v":"nok"},null,null,"FACT-ACCCTULLT"]
[null,"FACT-ACCCTUMIFC  MID 760239899",null,{"$f":"Sheet4!E38","v":"nok"},{"$f":"IF(Sheet4!E38=Sheet4!F2,Sheet4!E3,\"\")","v":""}]
[]
[null,"Standard Splice/Patch FACT chassis to be used (with smouv splice protector)"]
[null,{"$f":"Sheet10!J80","v":""},{"$f":"Sheet10!K80","v":""},{"$f":"Sheet10!L80","v":""}]
[null,{"$f":"Sheet10!J81","v":""},{"$f":"Sheet10!K81","v":""},{"$f":"Sheet10!L81","v":""}]
[null,{"$f":"Sheet10!J82","v":""},{"$f":"Sheet10!K82","v":""},{"$f":"Sheet10!L82","v":""}]
[null,{"$f":"Sheet10!J83","v":""},{"$f":"Sheet10!K83","v":""},{"$f":"Sheet10!L83","v":""}]
[null,{"$f":"Sheet10!J84","v":""},{"$f":"Sheet10!K84","v":""},{"$f":"Sheet10!L84","v":""}]
[null,{"$f":"Sheet10!J85","v":""},{"$f":"Sheet10!K85","v":""},{"$f":"Sheet10!L85","v":""}]
[null,{"$f":"Sheet10!J86","v":""},{"$f":"Sheet10!K86","v":""},{"$f":"Sheet10!L86","v":""}]
[null,{"$f":"Sheet10!J87","v":""},{"$f":"Sheet10!K87","v":""},{"$f":"Sheet10!L87","v":""}]

{"sheet":"Sheet4","index":1,"n_rows":69,"n_cols":18,"rows_kept":69,"cut":false,"hidden":true,"merged":[]}
[]
[null,null,"…",null,{"$f":"_xlfn.IFS(AND(C9=B10,C49=B49),\"\",AND(C9=B10,C49=B50),B62,AND(C9=B10,C49=B51),B63,AND(C9=B10,C49=B52),B64,AND(C9=B10,C49=B53),B65,AND(C9=B10,C49=B54),B66,AND(C9=B10,C49=B55),B67,AND(C9=B10,C49=B56),B68,AND(C9=B10,C49=B57),B69,AND(C9=B11,OR(C49=B49,C49=B50)),\"\",AND(C9=B11,OR(C49=B51,C49=B52)),B62,AND(C9=B11,OR(C49=B53,C49=B54)),B63,AND(C9=B11,C49=B55),B64,AND(C9=B11,C49=B56),B65,AND(C9=B11,C49=B57),B66)","v":{"$error":"#N/A"}},"ok "]
[null,null,null,null,{"$f":"_xlfn.IFS(AND(C9=B10,C49=B49),\"\",AND(C9=B10,C49=B50),B62,AND(C9=B10,C49=B51),B63,AND(C9=B10,C49=B52),B64,AND(C9=B10,C49=B53),B65,AND(C9=B10,C49=B54),B66,AND(C9=B10,C49=B55),B67,AND(C9=B10,C49=B56),B68,AND(C9=B10,C49=B57),B69,AND(C9=B11,OR(C49=B49,C49=B50)),\"\",AND(C9=B11,OR(C49=B51,C49=B52)),B62,AND(C9=B11,OR(C49=B53,C49=B54)),B63,AND(C9=B11,C49=B55),B64,AND(C9=B11,C49=B56),B65,AND(C9=B11,C49=B57),B66)","v":{"$error":"#N/A"}},"nok"]
[null,"frame type",{"$f":"Sheet1!D5","v":0},"tap Frame",null,"value Sheet 1"]
[null,null,null,null,"frame type",{"$f":"Sheet1!$D$5","v":0},{"$f":"IF(F5=0,0,1)","v":0}]
[null,"FACT FRAME",null,null,"connector type ",{"$f":"Sheet1!$D$7","v":0},{"$f":"IF(F6=0,0,1)","v":0}]
[null,"FIST-GR3 FRAME",null,null,"Cable type",{"$f":"Sheet1!$D$9","v":0}]
[null,null,{"$f":"IF(C4=0,C2,B9)","v":"…"},null,"amount of corrugated tubes per bracket",{"$f":"Sheet1!$D$11","v":0}]
[null,"connector type ",{"$f":"Sheet1!D7","v":0},"tap con","amount of Cables per bracket",{"$f":"Sheet1!$D$13","v":0}]
[null,"SC",null,null,"corrugated tube ID",{"$f":"Sheet1!$D$15","v":0}]
[null,"LC",null,null,"Cable diameter (mm)",{"$f":"Sheet1!$D$17","v":0}]
[null,null,{"$f":"IF(C9=0,C2,B13)","v":"…"},null,"Fibercount Cable/flex tube",{"$f":"Sheet1!$D$19","v":0}]
[null,"Cable/Tube type at CTU",{"$f":"Sheet1!D9","v":0},"tap cable",null,null,{"$f":"SUM(G5:G12)","v":0}]
[]
[null,"loose tube cable  (sub units)"]
[null,"corrugated tube (Flex tube)"]
[null,"IFC Cables (fibers with 900µ buffer)",null,null,null,null,null,null,null,null,null,null,null,null,null,null,"cor"]
[null,null,{"$f":"IF(C13=B16,B25,C2)","v":"…"},null,null,"frame type",null,{"$f":"Sheet1!$D$5","v":0},{"$f":"Sheet1!$D$5","v":0},{"$f":"Sheet1!$D$5","v":0},{"$f":"Sheet1!$D$5","v":0},{"$f":"Sheet1!$D$5","v":0},{"$f":"Sheet1!$D$5","v":0},{"$f":"Sheet1!$D$5","v":0},{"$f":"Sheet1!$D$5","v":0},{"$f":"Sheet1!$D$5","v":0},{"$f":"Sheet1!$D$5","v":0},{"$f":"Sheet1!$D$5","v":0}]
[null,"amount of Cables per cable attachment/CTU",{"$f":"IF(OR(B15=C13,B17=C13),B19,C2)","v":"…"},null,null,"connector type ",null,{"$f":"Sheet1!$D$7","v":0},{"$f":"Sheet1!$D$7","v":0},{"$f":"Sheet1!$D$7","v":0},{"$f":"Sheet1!$D$7","v":0},{"$f":"Sheet1!$D$7","v":0},{"$f":"Sheet1!$D$7","v":0},{"$f":"Sheet1!$D$7","v":0},{"$f":"Sheet1!$D$7","v":0},{"$f":"Sheet1!$D$7","v":0},{"$f":"Sheet1!$D$7","v":0},{"$f":"Sheet1!$D$7","v":0}]
[null,{"$f":"C20","v":"…"},{"$f":"IF(C19=B19,1,C2)","v":"…"},null,null,"Cable type",null,{"$f":"Sheet1!$D$9","v":0},{"$f":"Sheet1!$D$9","v":0},{"$f":"Sheet1!$D$9","v":0},{"$f":"Sheet1!$D$9","v":0},{"$f":"Sheet1!$D$9","v":0},{"$f":"Sheet1!$D$9","v":0},{"$f":"Sheet1!$D$9","v":0},{"$f":"Sheet1!$D$9","v":0},{"$f":"Sheet1!$D$9","v":0},{"$f":"Sheet1!$D$9","v":0},{"$f":"Sheet1!$D$9","v":0}]
[null,{"$f":"C21","v":"…"},{"$f":"IF($C$19=$B$19,2,$C$2)","v":"…"},null,null,"amount of corrugated tubes per bracket",null,{"$f":"Sheet1!$D$11","v":0},{"$f":"Sheet1!$D$11","v":0},{"$f":"Sheet1!$D$11","v":0},{"$f":"Sheet1!$D$11","v":0},{"$f":"Sheet1!$D$11","v":0},{"$f":"Sheet1!$D$11","v":0},{"$f":"Sheet1!$D$11","v":0},{"$f":"Sheet1!$D$11","v":0},{"$f":"Sheet1!$D$11","v":0},{"$f":"Sheet1!$D$11","v":0},{"$f":"Sheet1!$D$11","v":0}]
[null,"…",{"$f":"IF($C$19=$B$19,4,$C$2)","v":"…"},null,null,"amount of Cables per bracket",null,{"$f":"Sheet1!$D$13","v":0},{"$f":"Sheet1!$D$13","v":0},{"$f":"Sheet1!$D$13","v":0},{"$f":"Sheet1!$D$13","v":0},{"$f":"Sheet1!$D$13","v":0},{"$f":"Sheet1!$D$13","v":0},{"$f":"Sheet1!$D$13","v":0},{"$f":"Sheet1!$D$13","v":0},{"$f":"Sheet1!$D$13","v":0},{"$f":"Sheet1!$D$13","v":0},{"$f":"Sheet1!$D$13","v":0}]
[null,"…",{"$f":"IF($C$19=$B$19,6,$C$2)","v":"…"},null,null,"corrugated tube ID",null,{"$f":"Sheet1!$D$15","v":0},{"$f":"Sheet1!$D$15","v":0},{"$f":"Sheet1!$D$15","v":0},{"$f":"Sheet1!$D$15","v":0},{"$f":"Sheet1!$D$15","v":0},{"$f":"Sheet1!$D$15","v":0},{"$f":"Sheet1!$D$15","v":0},{"$f":"Sheet1!$D$15","v":0},{"$f":"Sheet1!$D$15","v":0},{"$f":"Sheet1!$D$15","v":0},{"$f":"Sheet1!$D$15","v":0}]
[null,null,null,null,null,"Cable diameter (mm)",null,{"$f":"Sheet1!$D$17","v":0},{"$f":"Sheet1!$D$17","v":0},{"$f":"Sheet1!$D$17","v":0},{"$f":"Sheet1!$D$17","v":0},{"$f":"Sheet1!$D$17","v":0},{"$f":"Sheet1!$D$17","v":0},{"$f":"Sheet1!$D$17","v":0},{"$f":"Sheet1!$D$17","v":0},{"$f":"Sheet1!$D$17","v":0},{"$f":"Sheet1!$D$17","v":0},{"$f":"Sheet1!$D$17","v":0}]
[null,"amount of flex tubes per cable attachment/CTU",null,null,null,"Fibercount Cable/flex tube",null,{"$f":"Sheet1!$D$19","v":0},{"$f":"Sheet1!$D$19","v":0},{"$f":"Sheet1!$D$19","v":0},{"$f":"Sheet1!$D$19","v":0},{"$f":"Sheet1!$D$19","v":0},{"$f":"Sheet1!$D$19","v":0},{"$f":"Sheet1!$D$19","v":0},{"$f":"Sheet1!$D$19","v":0},{"$f":"Sheet1!$D$19","v":0},{"$f":"Sheet1!$D$19","v":0},{"$f":"Sheet1!$D$19","v":0}]
[null,{"$f":"C26","v":"…"},{"$f":"IF($C$18=$B$25,1,$C$2)","v":"…"}]
[null,{"$f":"C27","v":"…"},{"$f":"IF($C$18=$B$25,2,$C$2)","v":"…"},null,{"$f":"IF(OR(H27=$F$2,I27=$F$2,J27=$F$2,K27=$F$2,L27=$F$2,L27=$F$2,L27=$F$2,M27=$F$2,N27=$F$2,O27=$F$2,P27=$F$2,Q27=$F$2,$R$27=$F$2),$F$2,$F$3)","v":"nok"},"FACT-FRACCCTU1E",null,{"$f":"IF(AND(C4=$B$6,C9=$B$10,C13=$B$15,C29=$C$20,OR(C45=$B$34,C45=$B$35,C45=$B$36,C45=$B$37,C45=$B$38),C49=$B$49),$F$2,$F$3)","v":"nok"},{"$f":"IF(AND(C4=$B$6,C9=$B$10,C13=$B$15,C29=$C$21,OR(C45=$B$34,C45=$B$35,C45=$B$36,C45=$B$37),C49=$B$49),$F$2,$F$3)","v":"nok"},{"$f":"IF(AND(C4=$B$6,C9=$B$10,C13=$B$15,C29=$C$22,C45=$B$34,C49=$B$49),$F$2,$F$3)","v":"nok"},{"$f":"IF(AND(C4=$B$6,C9=$B$11,C13=$B$15,C29=$C$20,OR(C45=$B$34,C45=$B$35,C45=$B$36,C45=$B$37,C45=$B$38),C49=$B$49),$F$2,$F$3)","v":"nok"},{"$f":"IF(AND(C4=$B$6,C9=$B$11,C13=$B$15,C29=$C$21,OR(C45=$B$34,C45=$B$35,C45=$B$36,C45=$B$37),C49=$B$49),$F$2,$F$3)","v":"nok"},{"$f":"IF(AND(C4=$B$6,C9=$B$11,C13=$B$15,C29=$C$22,C45=$B$34,C49=$B$49),$F$2,$F$3)","v":"nok"},{"$f":"IF(AND(C4=$B$6,C9=$B$11,C13=$B$15,C29=$C$20,OR(C45=$B$34,C45=$B$35,C45=$B$36,C45=$B$37,C45=$B$38),C49=$B$50),$F$2,$F$3)","v":"nok"},{"$f":"IF(AND(C4=$B$6,C9=$B$11,C13=$B$15,C29=$C$21,OR(C45=$B$34,C45=$B$35,C45=$B$36,C45=$B$37),C49=$B$50),$F$2,$F$3)","v":"nok"},{"$f":"IF(AND(C4=$B$6,C9=$B$11,C13=$B$15,C29=$C$22,C45=$B$34,C49=$B$50),$F$2,$F$3)","v":"nok"},{"$f":"IF(AND(C4=$B$6,C9=$B$10,C13=$B$16,C28=1,C44=$C$42,C49=$B$49),$F$2,$F$3)","v":"nok"},{"$f":"IF(AND($C$4=$B$6,$C$9=$B$11,$C$13=$B$16,$C$28=1,$C$44=$C$42,OR($C$49=$B$49,$R$25=$B$50)),$F$2,$F$3)","v":"nok"}]
[null,null,{"$f":"Sheet1!D11","v":0},"tap # cor",{"$f":"IF(OR(H28=$F$2,I28=$F$2,J28=$F$2,K28=$F$2,L28=$F$2,L28=$F$2,L28=$F$2,M28=$F$2,N28=$F$2,O28=$F$2,P28=$F$2,Q28=$F$2,$R$28=$F$2),$F$2,$F$3)","v":"nok"},"FACT-FRACCCTU2E",null,{"$f":"IF(AND(H18=$B$6,H19=$B$10,H20=$B$15,H22=$C$20,OR(H24=$B$34,H24=$B$35,H24=$B$36,H24=$B$37,H24=$B$38),H25=$B$50),$F$2,$F$3)","v":"nok"},{"$f":"IF(AND($I$18=$B$6,$I$19=$B$10,$I$20=$B$15,$I$22=$C$21,OR($I$24=$B$34,$I$24=$B$35,$I$24=$B$36,$I$24=$B$37),$I$25=$B$50),$F$2,$F$3)","v":"nok"},{"$f":"IF(AND($J$18=$B$6,$J$19=$B$10,$J$20=$B$15,$J$22=$C$22,$J$24=$B$34,$J$25=$B$50),$F$2,$F$3)","v":"nok"},{"$f":"IF(AND($K$18=$B$6,$K$19=$B$11,$K$20=$B$15,$K$22=$C$20,OR($K$24=$B$34,$K$24=$B$35,$K$24=$B$36,$K$24=$B$37,$K$24=$B$38),OR($K$25=$B$51,$K$25=$B$52)),$F$2,$F$3)","v":"nok"},{"$f":"IF(AND($L$18=$B$6,$L$19=$B$11,$L$20=$B$15,$L$22=$C$21,OR($L$24=$B$34,$L$24=$B$35,$L$24=$B$36,$L$24=$B$37),OR($L$25=$B$51,$L$25=$B$52)),$F$2,$F$3)","v":"nok"},{"$f":"IF(AND($M$18=$B$6,$M$19=$B$11,$M$20=$B$15,$M$22=$C$22,$M$24=$B$34,OR($M$25=$B$52,$M$25=$B$51)),$F$2,$F$3)","v":"nok"},{"$f":"IF(AND($N$18=$B$6,$N$19=$B$11,$N$20=$B$15,$N$22=$C$20,OR($N$24=$B$34,$N$24=$B$35,$N$24=$B$36,$N$24=$B$37,$N$24=$B$38),OR($N$25=$B$51,$N$25=$B$52)),$F$2,$F$3)","v":"nok"},{"$f":"IF(AND($O$18=$B$6,$O$19=$B$11,$O$20=$B$15,$O$22=$C$21,OR($O$24=$B$34,$O$24=$B$35,$O$24=$B$36,$O$24=$B$37),OR($O$25=$B$51,$O$25=$B$52)),$F$2,$F$3)","v":"nok"},{"$f":"IF(AND($C$4=$B$6,$C$9=$B$11,$C$13=$B$15,$C$29=$C$22,$C$45=$B$34,OR($C$49=$B$51,$C$49=$B$52)),$F$2,$F$3)","v":"nok"},{"$f":"IF(AND($C$4=$B$6,$C$9=$B$10,$C$13=$B$16,$C$28=1,$C$44=$C$42,$C$49=$B$50),$F$2,$F$3)","v":"nok"},{"$f":"IF(AND($C$4=$B$6,$C$9=$B$11,$C$13=$B$16,$C$28=1,$C$44=$C$42,OR($C$49=$B$51,$C$49=$B$52)),$F$2,$F$3)","v":"nok"}]
[null,null,{"$f":"Sheet1!D13","v":0},"tap # cables",{"$f":"IF(OR(H29=$F$2,I29=$F$2,J29=$F$2,K29=$F$2,L29=$F$2,L29=$F$2,L29=$F$2,M29=$F$2,N29=$F$2,O29=$F$2,P29=$F$2,Q29=$F$2,$R$29=$F$2),$F$2,$F$3)","v":"nok"},"FACT-FRACCCTU3E",null,{"$f":"IF(AND($H$18=$B$6,$H$19=$B$10,$H$20=$B$15,$H$22=$C$20,OR($H$24=$B$34,$H$24=$B$35,$H$24=$B$36,$H$24=$B$37,$H$24=$B$38),$H$25=$B$51),$F$2,$F$3)","v":"nok"},{"$f":"IF(AND($I$18=$B$6,$I$19=$B$10,$I$20=$B$15,$I$22=$C$21,OR($I$24=$B$34,$I$24=$B$35,$I$24=$B$36,$I$24=$B$37),$I$25=$B$51),$F$2,$F$3)","v":"nok"},{"$f":"IF(AND($J$18=$B$6,$J$19=$B$10,$J$20=$B$15,$J$22=$C$22,$J$24=$B$34,$J$25=$B$51),$F$2,$F$3)","v":"nok"},{"$f":"IF(AND($K$18=$B$6,$K$19=$B$11,$K$20=$B$15,$K$22=$C$20,OR($K$24=$B$34,$K$24=$B$35,$K$24=$B$36,$K$24=$B$37,$K$24=$B$38),$K$25=$B$54),$F$2,$F$3)","v":"nok"},{"$f":"IF(AND($L$18=$B$6,$L$19=$B$11,$L$20=$B$15,$L$22=$C$21,OR($L$24=$B$34,$L$24=$B$35,$L$24=$B$36,$L$24=$B$37),OR($L$25=$B$54,$L$25=$B$53)),$F$2,$F$3)","v":"nok"},{"$f":"IF(AND($M$18=$B$6,$M$19=$B$11,$M$20=$B$15,$M$22=$C$22,$M$24=$B$34,OR($M$25=$B$53,$M$25=$B$54)),$F$2,$F$3)","v":"nok"},{"$f":"IF(AND($N$18=$B$6,$N$19=$B$11,$N$20=$B$15,$N$22=$C$20,OR($N$24=$B$34,$N$24=$B$35,$N$24=$B$36,$N$24=$B$37,$N$24=$B$38),OR($N$25=$B$53,$N$25=$B$54)),$F$2,$F$3)","v":"nok"},{"$f":"IF(AND($O$18=$B$6,$O$19=$B$11,$O$20=$B$15,$O$22=$C$21,OR($O$24=$B$34,$O$24=$B$35,$O$24=$B$36,$O$24=$B$37),OR($O$25=$B$54,$O$25=$B$53)),$F$2,$F$3)","v":"nok"},{"$f":"IF(AND($P$18=$B$6,$P$19=$B$11,$P$20=$B$15,$P$22=$C$22,$P$24=$B$34,OR($P$25=$B$54,$P$25=$B$53)),$F$2,$F$3)","v":"nok"},{"$f":"IF(AND($Q$18=$B$6,$Q$19=$B$10,$Q$20=$B$16,$Q$21=1,$Q$23=$C$42,$Q$25=$B$51),$F$2,$F$3)","v":"nok"},{"$f":"IF(AND($R$18=$B$6,$R$19=$B$11,$R$20=$B$16,$R$21=1,$R$23=$C$42,OR($R$25=$B$53,$R$25=$B$54)),$F$2,$F$3)","v":"nok"}]
[null,null,{"$f":"IF(OR(C28=2,C28=1),B40,C2)","v":"…"},null,{"$f":"IF(OR(H30=$F$2,I30=$F$2,J30=$F$2,K30=$F$2,L30=$F$2,L30=$F$2,L30=$F$2,M30=$F$2,N30=$F$2,O30=$F$2,P30=$F$2,Q30=$F$2,$R$30=$F$2),$F$2,$F$3)","v":"nok"},"FACT-FRACCCTU4E",null,{"$f":"IF(AND($H$18=$B$6,$H$19=$B$10,$H$20=$B$15,$H$22=$C$20,OR($H$24=$B$34,$H$24=$B$35,$H$24=$B$36,$H$24=$B$37,$H$24=$B$38),$H$25=$B$52),$F$2,$F$3)","v":"nok"},{"$f":"IF(AND($I$18=$B$6,$I$19=$B$10,$I$20=$B$15,$I$22=$C$21,OR($I$24=$B$34,$I$24=$B$35,$I$24=$B$36,$I$24=$B$37),$I$25=$B$52),$F$2,$F$3)","v":"nok"},{"$f":"IF(AND($J$18=$B$6,$J$19=$B$10,$J$20=$B$15,$J$22=$C$22,$J$24=$B$34,$J$25=$B$52),$F$2,$F$3)","v":"nok"},{"$f":"IF(AND($K$18=$B$6,$K$19=$B$11,$K$20=$B$15,$K$22=$C$20,OR($K$24=$B$34,$K$24=$B$35,$K$24=$B$36,$K$24=$B$37,$K$24=$B$38),$K$25=$B$55),$F$2,$F$3)","v":"nok"},{"$f":"IF(AND($L$18=$B$6,$L$19=$B$11,$L$20=$B$15,$L$22=$C$21,OR($L$24=$B$34,$L$24=$B$35,$L$24=$B$36,$L$24=$B$37),$L$25=$B$55),$F$2,$F$3)","v":"nok"},{"$f":"IF(AND($M$18=$B$6,$M$19=$B$11,$M$20=$B$15,$M$22=$C$22,$M$24=$B$34,,$M$25=$B$55),$F$2,$F$3)","v":"nok"},{"$f":"IF(AND($N$18=$B$6,$N$19=$B$11,$N$20=$B$15,$N$22=$C$20,OR($N$24=$B$34,$N$24=$B$35,$N$24=$B$36,$N$24=$B$37,$N$24=$B$38),$N$25=$B$55),$F$2,$F$3)","v":"nok"},{"$f":"IF(AND($O$18=$B$6,$O$19=$B$11,$O$20=$B$15,$O$22=$C$21,OR($O$24=$B$34,$O$24=$B$35,$O$24=$B$36,$O$24=$B$37),$O$25=$B$55),$F$2,$F$3)","v":"nok"},{"$f":"IF(AND($P$18=$B$6,$P$19=$B$11,$P$20=$B$15,$P$22=$C$22,$P$24=$B$34,$P$25=$B$55),$F$2,$F$3)","v":"nok"},{"$f":"IF(AND($Q$18=$B$6,$Q$19=$B$10,$Q$20=$B$16,$Q$21=1,$Q$23=$C$42,$Q$25=$B$52),$F$2,$F$3)","v":"nok"},{"$f":"IF(AND($R$18=$B$6,$R$19=$B$11,$R$20=$B$16,$R$21=1,$R$23=$C$42,$R$25=$B$55),$F$2,$F$3)","v":"nok"}]
[null,null,{"$f":"IF(OR(C29=1,C29=2,C29=4,C29=6),B33,C2)","v":"…"},null,{"$f":"IF(OR(H31=$F$2,I31=$F$2,J31=$F$2,K31=$F$2,L31=$F$2,L31=$F$2,L31=$F$2,M31=$F$2,N31=$F$2,O31=$F$2,P31=$F$2,Q31=$F$2,$R$31=$F$2),$F$2,$F$3)","v":"nok"},"FACT-FRACCCTU5E",null,{"$f":"IF(AND($H$18=$B$6,$H$19=$B$10,$H$20=$B$15,$H$22=$C$20,OR($H$24=$B$34,$H$24=$B$35,$H$24=$B$36,$H$24=$B$37,$H$24=$B$38),$H$25=$B$53),$F$2,$F$3)","v":"nok"},{"$f":"IF(AND($I$18=$B$6,$I$19=$B$10,$I$20=$B$15,$I$22=$C$21,OR($I$24=$B$34,$I$24=$B$35,$I$24=$B$36,$I$24=$B$37),$I$25=$B$53),$F$2,$F$3)","v":"nok"},{"$f":"IF(AND($J$18=$B$6,$J$19=$B$10,$J$20=$B$15,$J$22=$C$22,$J$24=$B$34,$J$25=$B$53),$F$2,$F$3)","v":"nok"},{"$f":"IF(AND($K$18=$B$6,$K$19=$B$11,$K$20=$B$15,$K$22=$C$20,OR($K$24=$B$34,$K$24=$B$35,$K$24=$B$36,$K$24=$B$37,$K$24=$B$38),$K$25=$B$56),$F$2,$F$3)","v":"nok"},{"$f":"IF(AND($L$18=$B$6,$L$19=$B$11,$L$20=$B$15,$L$22=$C$21,OR($L$24=$B$34,$L$24=$B$35,$L$24=$B$36,$L$24=$B$37),$L$25=$B$56),$F$2,$F$3)","v":"nok"},{"$f":"IF(AND($M$18=$B$6,$M$19=$B$11,$M$20=$B$15,$M$22=$C$22,$M$24=$B$34,,$M$25=$B$56),$F$2,$F$3)","v":"nok"},{"$f":"IF(AND($N$18=$B$6,$N$19=$B$11,$N$20=$B$15,$N$22=$C$20,OR($N$24=$B$34,$N$24=$B$35,$N$24=$B$36,$N$24=$B$37,$N$24=$B$38),$N$25=$B$56),$F$2,$F$3)","v":"nok"},{"$f":"IF(AND($O$18=$B$6,$O$19=$B$11,$O$20=$B$15,$O$22=$C$21,OR($O$24=$B$34,$O$24=$B$35,$O$24=$B$36,$O$24=$B$37),$O$25=$B$56),$F$2,$F$3)","v":"nok"},{"$f":"IF(AND($P$18=$B$6,$P$19=$B$11,$P$20=$B$15,$P$22=$C$22,$P$24=$B$34,$P$25=$B$56),$F$2,$F$3)","v":"nok"},{"$f":"IF(AND($Q$18=$B$6,$Q$19=$B$10,$Q$20=$B$16,$Q$21=1,$Q$23=$C$42,$Q$25=$B$53),$F$2,$F$3)","v":"nok"},{"$f":"IF(AND($R$18=$B$6,$R$19=$B$11,$R$20=$B$16,$R$21=1,$R$23=$C$42,$R$25=$B$56),$F$2,$F$3)","v":"nok"}]
[null,null,null,null,{"$f":"IF(OR(H32=$F$2,I32=$F$2,J32=$F$2,K32=$F$2,L32=$F$2,L32=$F$2,L32=$F$2,M32=$F$2,N32=$F$2,O32=$F$2,P32=$F$2,Q32=$F$2,$R$32=$F$2),$F$2,$F$3)","v":"nok"},"FACT-FRACCCTU6E",null,{"$f":"IF(AND($H$18=$B$6,$H$19=$B$10,$H$20=$B$15,$H$22=$C$20,OR($H$24=$B$34,$H$24=$B$35,$H$24=$B$36,$H$24=$B$37,$H$24=$B$38),$H$25=$B$54),$F$2,$F$3)","v":"nok"},{"$f":"IF(AND($I$18=$B$6,$I$19=$B$10,$I$20=$B$15,$I$22=$C$21,OR($I$24=$B$34,$I$24=$B$35,$I$24=$B$36,$I$24=$B$37),$I$25=$B$54),$F$2,$F$3)","v":"nok"},{"$f":"IF(AND($J$18=$B$6,$J$19=$B$10,$J$20=$B$15,$J$22=$C$22,$J$24=$B$34,$J$25=$B$54),$F$2,$F$3)","v":"nok"},{"$f":"IF(AND($K$18=$B$6,$K$19=$B$11,$K$20=$B$15,$K$22=$C$20,OR($K$24=$B$34,$K$24=$B$35,$K$24=$B$36,$K$24=$B$37,$K$24=$B$38),$K$25=$B$57),$F$2,$F$3)","v":"nok"},{"$f":"IF(AND($L$18=$B$6,$L$19=$B$11,$L$20=$B$15,$L$22=$C$21,OR($L$24=$B$34,$L$24=$B$35,$L$24=$B$36,$L$24=$B$37),$L$25=$B$57),$F$2,$F$3)","v":"nok"},{"$f":"IF(AND($M$18=$B$6,$M$19=$B$11,$M$20=$B$15,$M$22=$C$22,$M$24=$B$34,,$M$25=$B$57),$F$2,$F$3)","v":"nok"},{"$f":"IF(AND($N$18=$B$6,$N$19=$B$11,$N$20=$B$15,$N$22=$C$20,OR($N$24=$B$34,$N$24=$B$35,$N$24=$B$36,$N$24=$B$37,$N$24=$B$38),$N$25=$B$57),$F$2,$F$3)","v":"nok"},{"$f":"IF(AND($O$18=$B$6,$O$19=$B$11,$O$20=$B$15,$O$22=$C$21,OR($O$24=$B$34,$O$24=$B$35,$O$24=$B$36,$O$24=$B$37),$O$25=$B$57),$F$2,$F$3)","v":"nok"},{"$f":"IF(AND($P$18=$B$6,$P$19=$B$11,$P$20=$B$15,$P$22=$C$22,$P$24=$B$34,$P$25=$B$57),$F$2,$F$3)","v":"nok"},{"$f":"IF(AND($Q$18=$B$6,$Q$19=$B$10,$Q$20=$B$16,$Q$21=1,$Q$23=$C$42,$Q$25=$B$54),$F$2,$F$3)","v":"nok"},{"$f":"IF(AND($R$18=$B$6,$R$19=$B$11,$R$20=$B$16,$R$21=1,$R$23=$C$42,$R$25=$B$57),$F$2,$F$3)","v":"nok"}]
[null,"Cable diameter Ø (mm)",{"$f":"IF(AND(C28=0,C29=0),C2,B33)","v":"…"},null,{"$f":"IF(OR(H33=$F$2,I33=$F$2,J33=$F$2,K33=$F$2,L33=$F$2,L33=$F$2,L33=$F$2,M33=$F$2,N33=$F$2,O33=$F$2,P33=$F$2,Q33=$F$2,$R$33=$F$2),$F$2,$F$3)","v":"nok"},"FACT-ACCCTU6x7mm",null,{"$f":"IF(AND(OR($H$18=$B$7,$H$18=$B$6),$H$19=$B$10,$H$20=$B$15,OR($H$22=$C$20,$H$22=$C$21,$H$22=$C$22,$H$22=$C$23),OR($H$24=$B$34,$H$24=$B$35,$H$24=$B$36),$H$25=$B$49),$F$2,$F$3)","v":"nok"},{"$f":"IF(AND(OR($H$18=$B$7,$H$18=$B$6),$H$19=$B$11,$H$20=$B$15,OR($H$22=$C$20,$H$22=$C$21,$H$22=$C$22,$H$22=$C$23),OR($H$24=$B$34,$H$24=$B$35,$H$24=$B$36),OR($H$25=$B$50,$H$25=$B$49)),$F$2,$F$3)","v":"nok"}]
[null,{"$f":"IF($C$31=$B$33,C34,$C$2)","v":"…"}," Ø 2.5 to 5 mm",null,"nok","FACT-ACCCTUSLT",null,{"$f":"IF(AND($H$18=$B$7,$H$19=$B$10,$H$20=$B$15,$H$22=$C$20,OR($H$24=$B$34,$H$24=$B$35,$H$24=$B$36,$H$24=$B$37),$H$25=$B$49),$F$2,$F$3)","v":"nok"},{"$f":"IF(AND($H$18=$B$7,$H$19=$B$10,$H$20=$B$15,$H$22=$C$21,$H$24=$B$34,$H$25=$B$49),$F$2,$F$3)","v":"nok"},{"$f":"IF(AND($H$18=$B$7,$H$19=$B$11,$H$20=$B$15,$H$22=$C$20,OR($H$24=$B$34,$H$24=$B$35,$H$24=$B$36,$H$24=$B$37),OR($H$25=$B$50,$H$25=$B$49)),$F$2,$F$3)","v":"nok"},{"$f":"IF(AND($H$18=$B$7,$H$19=$B$11,$H$20=$B$15,$H$22=$C$21,$H$24=$B$34,OR($H$25=$B$50,$H$25=$B$49)),$F$2,$F$3)","v":"nok"},{"$f":"IF(AND($H$18=$B$7,$H$19=$B$10,$H$20=$B$16,$H$21=$C$26,$H$23=$C$41,$H$25=$B$49),$F$2,$F$3)","v":"nok"},{"$f":"IF(AND($H$18=$B$7,$H$19=$B$11,$H$20=$B$16,$H$21=$C$26,$H$23=$C$41,OR($H$25=$B$50,$H$25=$B$49)),$F$2,$F$3)","v":"nok"}]
[null,{"$f":"IF($C$31=$B$33,C35,$C$2)","v":"…"}," Ø 5 to 6 mm",null,"nok","FACT-ACCCTUMLT",null,{"$f":"IF(AND($H$18=$B$7,$H$19=$B$10,$H$20=$B$15,$H$22=$C$20,OR($H$24=$B$34,$H$24=$B$35,$H$24=$B$36,$H$24=$B$37,$H$24=$B$38),OR($H$25=$B$49,$H$25=$B$50,$H$25=$B$51,$H$25=$B$52,$H$25=$B$53,$H$25=$B$54)),$F$2,$F$3)","v":"nok"},{"$f":"IF(AND($H$18=$B$7,$H$19=$B$11,$H$20=$B$15,$H$22=$C$20,OR($H$24=$B$34,$H$24=$B$35,$H$24=$B$36,$H$24=$B$37,$H$24=$B$38),OR($H$25=$B$49,$H$25=$B$50,$H$25=$B$51,$H$25=$B$52,$H$25=$B$53,$H$25=$B$54,$H$25=$B$55,$H$25=$B$56,$H$25=$B$57)),$F$2,$F$3)","v":"nok"},{"$f":"IF(AND($H$18=$B$7,$H$19=$B$10,$H$20=$B$15,$H$22=$C$21,OR($H$24=$B$34,$H$24=$B$35,$H$24=$B$36,$H$24=$B$37),OR($H$25=$B$49,$H$25=$B$50,$H$25=$B$51,$H$25=$B$52,$H$25=$B$53,$H$25=$B$54,$H$25=$B$55,$H$25=$B$56,$H$25=$B$57)),$F$2,$F$3)","v":"nok"},{"$f":"IF(AND($H$18=$B$7,$H$19=$B$11,$H$20=$B$15,$H$22=$C$21,OR($H$24=$B$34,$H$24=$B$35,$H$24=$B$36,$H$24=$B$37),OR($H$25=$B$49,$H$25=$B$50,$H$25=$B$51,$H$25=$B$52,$H$25=$B$53,$H$25=$B$54,$H$25=$B$55,$H$25=$B$56,$H$25=$B$57)),$F$2,$F$3)","v":"nok"},{"$f":"IF(AND($H$18=$B$7,$H$19=$B$10,$H$20=$B$15,$H$22=$C$22,$H$24=$B$34,OR($H$25=$B$49,$H$25=$B$50,$H$25=$B$51,$H$25=$B$52,$H$25=$B$53,$H$25=$B$54,$H$25=$B$55,$H$25=$B$56,$H$25=$B$57)),$F$2,$F$3)","v":"nok"},{"$f":"IF(AND($H$18=$B$7,$H$19=$B$11,$H$20=$B$15,$H$22=$C$22,$H$24=$B$34,OR($H$25=$B$49,$H$25=$B$50,$H$25=$B$51,$H$25=$B$52,$H$25=$B$53,$H$25=$B$54,$H$25=$B$55,$H$25=$B$56,$H$25=$B$57)),$F$2,$F$3)","v":"nok"},{"$f":"IF(AND($H$18=$B$7,$H$19=$B$10,$H$20=$B$16,$H$21=$C$26,$H$23=$C$42,OR($H$25=$B$49,$H$25=$B$50,$H$25=$B$51,$H$25=$B$52,$H$25=$B$53,$H$25=$B$54,$H$25=$B$55,$H$25=$B$56,$H$25=$B$57)),$F$2,$F$3)","v":"nok"},{"$f":"IF(AND($H$18=$B$7,$H$19=$B$11,$H$20=$B$16,$H$21=$C$26,$H$23=$C$42,OR($H$25=$B$49,$H$25=$B$50,$H$25=$B$51,$H$25=$B$52,$H$25=$B$53,$H$25=$B$54,$H$25=$B$55,$H$25=$B$56,$H$25=$B$57)),$F$2,$F$3)","v":"nok"},{"$f":"IF(AND($H$18=$B$7,$H$19=$B$10,$H$20=$B$16,$H$21=$C$27,$H$23=$C$41,OR($H$25=$B$49,$H$25=$B$50,$H$25=$B$51,$H$25=$B$52,$H$25=$B$53,$H$25=$B$54,$H$25=$B$55,$H$25=$B$56,$H$25=$B$57)),$F$2,$F$3)","v":"nok"},{"$f":"IF(AND($H$18=$B$7,$H$19=$B$11,$H$20=$B$16,OR($H$21=1,$H$21=2),$H$23=$C$41,OR($H$25=$B$49,$H$25=$B$50,$H$25=$B$51,$H$25=$B$52,$H$25=$B$53,$H$25=$B$54,$H$25=$B$55,$H$25=$B$56,$H$25=$B$57)),$F$2,$F$3)","v":"nok"}]
[null,{"$f":"IF($C$31=$B$33,C36,$C$2)","v":"…"}," Ø 6 to 7 mm",null,"nok","FACT-ACCCTULLT",null,{"$f":"IF(AND($H$18=$B$7,$H$19=$B$10,$H$20=$B$15,$H$22=$C$20,OR($H$24=$B$34,$H$24=$B$35,$H$24=$B$36,$H$24=$B$37,$H$24=$B$38),OR($H$25=$B$49,$H$25=$B$50,$H$25=$B$51)),$F$2,$F$3)","v":"nok"},{"$f":"IF(AND($H$18=$B$7,$H$19=$B$11,$H$20=$B$15,$H$22=$C$20,OR($H$24=$B$34,$H$24=$B$35,$H$24=$B$36,$H$24=$B$37,$H$24=$B$38),OR($H$25=$B$49,$H$25=$B$50,$H$25=$B$51,$H$25=$B$52,$H$25=$B$53,$H$25=$B$54)),$F$2,$F$3)","v":"nok"},{"$f":"IF(AND($H$18=$B$7,$H$19=$B$10,$H$20=$B$15,$H$22=$C$21,OR($H$24=$B$34,$H$24=$B$35,$H$24=$B$36,$H$24=$B$37),OR($H$25=$B$49,$H$25=$B$50,$H$25=$B$51)),$F$2,$F$3)","v":"nok"},{"$f":"IF(AND($H$18=$B$7,$H$19=$B$11,$H$20=$B$15,$H$22=$C$21,OR($H$24=$B$34,$H$24=$B$35,$H$24=$B$36,$H$24=$B$37),OR($H$25=$B$49,$H$25=$B$50,$H$25=$B$51,$H$25=$B$52,$H$25=$B$53,$H$25=$B$54)),$F$2,$F$3)","v":"nok"},{"$f":"IF(AND($H$18=$B$7,$H$19=$B$10,$H$20=$B$15,$H$22=$C$22,$H$24=$B$34,OR($H$25=$B$49,$H$25=$B$50,$H$25=$B$51)),$F$2,$F$3)","v":"nok"},{"$f":"IF(AND($H$18=$B$7,$H$19=$B$11,$H$20=$B$15,$H$22=$C$22,$H$24=$B$34,OR($H$25=$B$49,$H$25=$B$50,$H$25=$B$51,$H$25=$B$52,$H$25=$B$53,$H$25=$B$54)),$F$2,$F$3)","v":"nok"},{"$f":"IF(AND($H$18=$B$7,$H$19=$B$10,$H$20=$B$16,$H$21=$C$20,$H$23=$C$42,OR($H$25=$B$49,$H$25=$B$50,$H$25=$B$51,$H$25=$B$52,$H$25=$B$53,$H$25=$B$54,$H$25=$B$55,$H$25=$B$56,$H$25=$B$57)),$F$2,$F$3)","v":"nok"},{"$f":"IF(AND($H$18=$B$7,$H$19=$B$11,$H$20=$B$16,$H$21=$C$20,$H$23=$C$42,OR($H$25=$B$49,$H$25=$B$50,$H$25=$B$51,$H$25=$B$52,$H$25=$B$53,$H$25=$B$54,$H$25=$B$55,$H$25=$B$56,$H$25=$B$57)),$F$2,$F$3)","v":"nok"},{"$f":"IF(AND($H$18=$B$7,$H$19=$B$10,$H$20=$B$16,$H$21=$C$21,$H$23=$C$41,OR($H$25=$B$49,$H$25=$B$50,$H$25=$B$51,$H$25=$B$52,$H$25=$B$53,$H$25=$B$54,$H$25=$B$55,$H$25=$B$56,$H$25=$B$57)),$F$2,$F$3)","v":"nok"},{"$f":"IF(AND($H$18=$B$7,$H$19=$B$11,$H$20=$B$16,OR($H$21=1,$H$21=2),$H$23=$C$41,OR($H$25=$B$49,$H$25=$B$50,$H$25=$B$51,$H$25=$B$52,$H$25=$B$53,$H$25=$B$54,$H$25=$B$55,$H$25=$B$56,$H$25=$B$57)),$F$2,$F$3)","v":"nok"}]
[null,{"$f":"IF($C$31=$B$33,C37,$C$2)","v":"…"}," Ø 7 to 8.5 mm",null,"nok","FACT-ACCCTUSIFC",null,{"$f":"IF(AND(OR($H$18=$B$7,$H$18=$B$6),$H$19=$B$10,$H$20=$B$17,$H$22=$C$20,OR($H$24=$B$34,$H$24=$B$35,$H$24=$B$36,$H$24=$B$37),$H$25=$B$49),$F$2,$F$3)","v":"nok"},{"$f":"IF(AND(OR($H$18=$B$7,$H$18=$B$6),$H$19=$B$10,$H$20=$B$17,$H$22=$C$21,OR($H$24=$B$35,$H$24=$B$34),$H$25=$B$49),$F$2,$F$3)","v":"nok"},{"$f":"IF(AND(OR($H$18=$B$7,$H$18=$B$6),$H$19=$B$11,$H$20=$B$17,$H$22=$C$20,OR($H$24=$B$34,$H$24=$B$35,$H$24=$B$36,$H$24=$B$37),OR($H$25=$B$50,$H$25=$B$49)),$F$2,$F$3)","v":"nok"},{"$f":"IF(AND(OR($H$18=$B$7,$H$18=$B$6),$H$19=$B$11,$H$20=$B$17,$H$22=$C$21,OR($H$24=$B$35,$H$24=$B$34),OR($H$25=$B$50,$H$25=$B$49)),$F$2,$F$3)","v":"nok"}]
[null,{"$f":"IF($C$31=$B$33,C38,$C$2)","v":"…"}," Ø 8.5 to 15 mm",null,"nok","FACT-ACCCTUMIFC",null,{"$f":"IF(AND(OR($H$18=$B$7,$H$18=$B$6),$H$19=$B$10,$H$20=$B$17,$H$22=$C$20,OR($H$24=$B$34,$H$24=$B$35,$H$24=$B$36,$H$24=$B$37,$H$24=$B$38),OR($H$25=$B$49,$H$25=$B$50,$H$25=$B$51,$H$25=$B$52,$H$25=$B$53,$H$25=$B$54)),$F$2,$F$3)","v":"nok"},{"$f":"IF(AND(OR($H$18=$B$7,$H$18=$B$6),$H$19=$B$11,$H$20=$B$17,$H$22=$C$20,OR($H$24=$B$34,$H$24=$B$35,$H$24=$B$36,$H$24=$B$37,$H$24=$B$38),OR($H$25=$B$49,$H$25=$B$50,$H$25=$B$51,$H$25=$B$52,$H$25=$B$53,$H$25=$B$54,$H$25=$B$55,$H$25=$B$56,$H$25=$B$57)),$F$2,$F$3)","v":"nok"},{"$f":"IF(AND(OR($H$18=$B$7,$H$18=$B$6),$H$19=$B$10,$H$20=$B$17,$H$22=$C$21,OR($H$24=$B$34,$H$24=$B$35,$H$24=$B$36,$H$24=$B$37),OR($H$25=$B$49,$H$25=$B$50,$H$25=$B$51,$H$25=$B$52,$H$25=$B$53,$H$25=$B$54,$H$25=$B$55,$H$25=$B$56,$H$25=$B$57)),$F$2,$F$3)","v":"nok"},{"$f":"IF(AND(OR($H$18=$B$7,$H$18=$B$6),$H$19=$B$11,$H$20=$B$17,$H$22=$C$21,OR($H$24=$B$34,$H$24=$B$35,$H$24=$B$36,$H$24=$B$37),OR($H$25=$B$49,$H$25=$B$50,$H$25=$B$51,$H$25=$B$52,$H$25=$B$53,$H$25=$B$54,$H$25=$B$55,$H$25=$B$56,$H$25=$B$57)),$F$2,$F$3)","v":"nok"},null,null,{"$f":"IF(AND(OR($H$18=$B$7,$H$18=$B$6),$H$19=$B$10,$H$20=$B$16,$H$21=$C$20,$H$23=$C$42,OR($H$25=$B$49,$H$25=$B$50,$H$25=$B$51,$H$25=$B$52,$H$25=$B$53,$H$25=$B$54,$H$25=$B$55,$H$25=$B$56,$H$25=$B$57)),$F$2,$F$3)","v":"nok"},{"$f":"IF(AND(OR($H$18=$B$7,$H$18=$B$6),$H$19=$B$11,$H$20=$B$16,$H$21=$C$20,$H$23=$C$42,OR($H$25=$B$49,$H$25=$B$50,$H$25=$B$51,$H$25=$B$52,$H$25=$B$53,$H$25=$B$54,$H$25=$B$55,$H$25=$B$56,$H$25=$B$57)),$F$2,$F$3)","v":"nok"},{"$f":"IF(AND(OR($H$18=$B$7,$H$18=$B$6),$H$19=$B$10,$H$20=$B$16,$H$21=$C$21,$H$23=$C$41,OR($H$25=$B$49,$H$25=$B$50,$H$25=$B$51,$H$25=$B$52,$H$25=$B$53,$H$25=$B$54,$H$25=$B$55,$H$25=$B$56,$H$25=$B$57)),$F$2,$F$3)","v":"nok"},{"$f":"IF(AND(OR($H$18=$B$7,$H$18=$B$6),$H$19=$B$11,$H$20=$B$16,$H$21=$C$21,$H$23=$C$41,OR($H$25=$B$49,$H$25=$B$50,$H$25=$B$51,$H$25=$B$52,$H$25=$B$53,$H$25=$B$54,$H$25=$B$55,$H$25=$B$56,$H$25=$B$57)),$F$2,$F$3)","v":"nok"}]
[]
[null,"corrugated tube ID Ø "]
[null,{"$f":"IF($C$30=$B$40,C41,$C$2)","v":"…"}," Ø 6 mm Inner Diameter"]
[null,{"$f":"IF($C$30=$B$40,C42,$C$2)","v":"…"}," Ø 12 mm Inner Diameter"]
[null,null,null,null,"fact chassis"]
[null,null,{"$f":"Sheet1!D15","v":0},"tap dia cor",null,"FACT-FRACCCTU1E",null,{"$f":"IF(AND(E27=$F$2,$C$9=$B$10,$C$49=$B$49),\"1\",\"\")","v":""}]
[null,null,{"$f":"Sheet1!D17","v":0},"tap dia cab",null,"FACT-FRACCCTU2E",null,{"$f":"IF(AND(E28=$F$2,$C$49=$B$49),\"1\",\"\")","v":""}]
[null,null,null,null,null,"FACT-FRACCCTU3E",null,""]
[null,null,{"$f":"IF(AND(C44=0,C45=0),C2,B48)","v":"…"},null,null,"FACT-FRACCCTU4E",null,""]
[null,"Total Fibercount on the CTU",null,null,null,"FACT-FRACCCTU5E",null,""]
[null,"up to 24 fibers",{"$f":"Sheet1!D19","v":0},"tap # fiber",null,"FACT-FRACCCTU6E",null,""]
[null,"48 fibers",null,null,null,"FACT-ACCCTU6x7mm",null,""]
[null,"72 fibers",null,null,null,"FACT-ACCCTUSLT",null,""]
[null,"96 fibers",null,null,null,"FACT-ACCCTUMLT",null,""]
[null,"120 fibers",null,null,null,"FACT-ACCCTULLT",null,""]
[null,"144 fibers",null,null,null,"FACT-ACCCTUSIFC",null,""]
[null,"192 fibers",null,null,null,"FACT-ACCCTUMIFC",null,""]
[null,"240 fibers"]
[null,"288 fibers"]
[]
[]
[]
[]
[null,"use 2  CTU's (one per Element)"]
[null,"use 3  CTU's (one per Element)"]
[null,"use 4  CTU's (one per Element)"]
[null,"use 5  CTU's (one per Element)"]
[null,"use 6  CTU's (one per Element)"]
[null,"use 8 CTU's (one per Element)"]
[null,"use 10 CTU's (one per Element)"]
[null,"use 12 CTU's (one per Element)"]

{"sheet":"Sheet10","index":2,"n_rows":91,"n_cols":21,"rows_kept":91,"cut":false,"hidden":true,"merged":[]}
[]
[null,"fact chassis",null,"SC","LC"]
[null,{"$f":"Sheet4!E27","v":"nok"},"FACT-FRACCCTU1E",{"$f":"IF(C21=D2,C16,C17)","v":"nok"},{"$f":"IF(C21=E2,C16,C17)","v":"nok"},null,null,null,null,null,760240005,"FACT-1ERHPS2S","Right hand patch SC/APC Grade C",760240585,"FACT-1ERHPL1S","Right hand patch LC/APC Grade C",760240456,"FACT-1ELHPE9S",null,760240448,"FACT-1ELHPS4S"]
[null,{"$f":"Sheet4!E28","v":"nok"},"FACT-FRACCCTU2E",null,null,null,null,null,null,null,760240018,"FACT-1ERHPS1S","Right hand patch SC/UPC Grade C",760240586,"FACT-1ERHPL2S","Right hand patch LC/UPC Grade C",760240591,"FACT-1ERHPE9S",null,760240449,"FACT-1ELHPS5S"]
[null,{"$f":"Sheet4!E29","v":"nok"},"FACT-FRACCCTU3E",null,null,null,null,null,null,null,760240582,"FACT-1ERHPSGS","Right hand patch SC/APC Grade B",760240588,"FACT-1ERHPLGS","Right hand patch LC/APC Grade B",760249883,"FACT-1ELHPECS",null,760240583,"FACT-1ERHPS4S"]
[null,{"$f":"Sheet4!E30","v":"nok"},"FACT-FRACCCTU4E",null,null,null,null,null,null,null,760240581,"FACT-1ERHPSFS","Right hand patch SC/UPC Grade B",760240587,"FACT-1ERHPLFS","Right hand patch LC/UPC Grade B",760249894,"FACT-1ERHPECS",null,760240584,"FACT-1ERHPS5S"]
[null,{"$f":"Sheet4!E31","v":"nok"},"FACT-FRACCCTU5E",null,null,null,null,null,null,null,760240445,"FACT-1ELHPS2S","Left hand patch SC/APC Grade C",760240000,"FACT-1ELHPL2S","Left hand patch LC/APC Grade C",null,null,null,760240589,"FACT-1ERHPL4S"]
[null,{"$f":"Sheet4!E32","v":"nok"},"FACT-FRACCCTU6E",null,null,null,null,null,null,null,760239999,"FACT-1ELHPS1S","Left hand patch SC/UPC Grade C",760240450,"FACT-1ELHPL1S","Left hand patch LC/UPC Grade C",null,null,null,760240590,"FACT-1ERHPL5S"]
[null,{"$f":"Sheet4!E33","v":"nok"},"FACT-ACCCTU6x7mm",null,null,null,null,null,null,null,760240447,"FACT-1ELHPSGS","Left hand patch SC/APC Grade B",760240453,"FACT-1ELHPLGS","Left hand patch LC/APC Grade B",null,null,null,760240454,"FACT-1ELHPL4S"]
[null,{"$f":"Sheet4!E34","v":"nok"},"FACT-ACCCTUSLT",null,null,null,null,null,null,null,760240446,"FACT-1ELHPSFS","Left hand patch SC/UPC Grade B",760240452,"FACT-1ELHPLFS","Left hand patch LC/UPC Grade B",null,null,null,760240455,"FACT-1ELHPL5S"]
[null,{"$f":"Sheet4!E35","v":"nok"},"FACT-ACCCTUMLT"]
[null,{"$f":"Sheet4!E36","v":"nok"},"FACT-ACCCTULLT",null,null,null,null,null,null,null,760240605,"FACT-2ERHPS2S","Right hand patch SC/APC Grade C",760240021,"FACT-2ERHPL2S","Right hand patch LC/APC Grade C",760240478,"FACT-2ELHPE9S",null,760240473,"FACT-2ELHPS4S"]
[null,{"$f":"Sheet4!E37","v":"nok"},"FACT-ACCCTUSIFC",null,null,null,null,null,null,null,760240019,"FACT-2ERHPS1S","Right hand patch SC/UPC Grade C",760240020,"FACT-2ERHPL1S","Right hand patch LC/UPC Grade C",760240613,"FACT-2ERHPE9S",null,760240474,"FACT-2ELHPS5S"]
[null,{"$f":"Sheet4!E38","v":"nok"},"FACT-ACCCTUMIFC",null,null,null,null,null,null,null,760240607,"FACT-2ERHPSGS","Right hand patch SC/APC Grade B",760240611,"FACT-2ERHPLGS","Right hand patch LC/APC Grade B",760249885,"FACT-2ELHPECS",null,760240608,"FACT-2ERHPS4S"]
[null,null,null,null,null,null,null,null,null,null,760240606,"FACT-2ERHPSFS","Right hand patch SC/UPC Grade B",760240610,"FACT-2ERHPLFS","Right hand patch LC/UPC Grade B",760249896,"FACT-2ERHPECS",null,760240609,"FACT-2ERHPS5S"]
[null,null,{"$f":"Sheet4!F2","v":"ok "},null,null,null,null,null,null,null,760240470,"FACT-2ELHPS2S","Left hand patch SC/APC Grade C",760240002,"FACT-2ELHPL2S","Left hand patch LC/APC Grade C",null,null,null,760257256,"FACT-2ERHPS3S"]
[null,null,"nok",null,null,null,null,null,null,null,760240469,"FACT-2ELHPS1S","Left hand patch SC/UPC Grade C",760240001,"FACT-2ELHPL1S","Left hand patch LC/UPC Grade C",null,null,null,760240612,"FACT-2ERHPL5S"]
[null,null,null,null,null,null,"up to 24 fibers",null,null,null,760240472,"FACT-2ELHPSGS","Left hand patch SC/APC Grade B",760240476,"FACT-2ELHPLGS","Left hand patch LC/APC Grade B",null,null,null,760240003,"FACT-2ELHPL4S"]
[null,null,null,null,null,null,"48 fibers",null,null,null,760240471,"FACT-2ELHPSFS","Left hand patch SC/UPC Grade B",760240475,"FACT-2ELHPLFS","Left hand patch LC/UPC Grade B",null,null,null,760240022,"FACT-2ERHPL4S"]
[null,{"$f":"Sheet4!F18","v":"frame type"},{"$f":"Sheet4!H18","v":0},null,null,null,"72 fibers",null,null,null,null,null,null,null,null,null,null,null,null,760240477,"FACT-2ELHPL5S"]
[null,{"$f":"Sheet4!F19","v":"connector type "},{"$f":"Sheet4!H19","v":0},null,null,null,"96 fibers",null,null,null,null,null,null,null,null,null,null,null,null,760257256,"FACT-2ERHPS3S"]
[null,{"$f":"Sheet4!F20","v":"Cable type"},{"$f":"Sheet4!H20","v":0},null,null,null,"120 fibers"]
[null,{"$f":"Sheet4!F21","v":"amount of corrugated tubes per bracket"},{"$f":"Sheet4!H21","v":0},null,null,null,"144 fibers",null,null,null,760240025,"FACT-3ERHPS1S","Right hand patch SC/APC Grade C",760240027,"FACT-3ERHPL1S","Right hand patch LC/APC Grade C",760240497,"FACT-3ELHPE9S",null,760240411,"FACT-3ELHPS5S"]
[null,{"$f":"Sheet4!F22","v":"amount of Cables per bracket"},{"$f":"Sheet4!H22","v":0},null,null,null,"192 fibers",null,null,null,760240074,"FACT-3ERHPS2S","Right hand patch SC/UPC Grade C",760240028,"FACT-3ERHPL2S","Right hand patch LC/UPC Grade C",760240632,"FACT-3ERHPE9S",null,760240493,"FACT-3ELHPS4S"]
[null,{"$f":"Sheet4!F23","v":"corrugated tube ID"},{"$f":"Sheet4!H23","v":0},null,null,null,"240 fibers",null,null,null,760240626,"FACT-3ERHPSGS","Right hand patch SC/APC Grade B",760240630,"FACT-3ERHPLGS","Right hand patch LC/APC Grade B",760249887,"FACT-3ELHPECS",null,760240627,"FACT-3ERHPS4S"]
[null,{"$f":"Sheet4!F24","v":"Cable diameter (mm)"},{"$f":"Sheet4!H24","v":0},null,null,null,"288 fibers",null,null,null,760240625,"FACT-3ERHPSFS","Right hand patch SC/UPC Grade B",760240629,"FACT-3ERHPLFS","Right hand patch LC/UPC Grade B",760249898,"FACT-3ERHPECS",null,760240628,"FACT-3ERHPS5S"]
[null,{"$f":"Sheet4!F25","v":"Fibercount Cable/flex tube"},{"$f":"Sheet4!H25","v":0},null,null,null,"---",null,null,null,760240491,"FACT-3ELHPS1S","Left hand patch SC/APC Grade C",760240007,"FACT-3ELHPL1S","Left hand patch LC/APC Grade C",null,null,null,760240631,"FACT-3ERHPL5S"]
[null,null,null,null,null,null,"",null,null,null,760240075,"FACT-3ELHPS2S","Left hand patch SC/UPC Grade C",760240008,"FACT-3ELHPL2S","Left hand patch LC/UPC Grade C",null,null,null,760240029,"FACT-3ERHPL4S"]
[1,{"$f":"IF(AND(OR($B$3=$C$16,$B$9=$C$16,$B$10=$C$16,$B$11=$C$16,$B$12=$C$16,$B$13=$C$16,$B$14=$C$16),$C$27=$G$18),K3,\"\")","v":""},{"$f":"IF(AND(OR($B$3=$C$16,$B$9=$C$16,$B$10=$C$16,$B$11=$C$16,$B$12=$C$16,$B$13=$C$16,$B$14=$C$16),$C$27=$G$18),L3,\"\")","v":""},"",{"$f":"IF(AND(OR($B$3=$C$16,AND($B$9=$C$16,$E$3=$C$16),$B$10=$C$16,$B$11=$C$16,$B$12=$C$16,$B$13=$C$16,$B$14=$C$16),OR($C$27=$G$19,$C$27=$G$18)),N3,\"\")","v":""},{"$f":"IF(AND(OR($B$3=$C$16,AND($B$9=$C$16,$E$3=$C$16),$B$10=$C$16,$B$11=$C$16,$B$12=$C$16,$B$13=$C$16,$B$14=$C$16),OR($C$27=$G$19,$C$27=$G$18)),O3,\"\")","v":""},"",{"$f":"SEARCH(\"760\",B29)","v":{"$error":"#VALUE!"}},{"$f":"ISNUMBER(H29)","v":false},null,760240006,"FACT-3ELHPSGS","Left hand patch SC/APC Grade B",760240495,"FACT-3ELHPLGS","Left hand patch LC/APC Grade B",null,null,null,760240009,"FACT-3ELHPL4S"]
[1,{"$f":"IF(AND(OR($B$3=$C$16,$B$9=$C$16,$B$10=$C$16,$B$11=$C$16,$B$12=$C$16,$B$13=$C$16,$B$14=$C$16),$C$27=$G$18),K4,\"\")","v":""},{"$f":"IF(AND(OR($B$3=$C$16,$B$9=$C$16,$B$10=$C$16,$B$11=$C$16,$B$12=$C$16,$B$13=$C$16,$B$14=$C$16),$C$27=$G$18),L4,\"\")","v":""},{"$f":"IF(AND(OR($B$3=$C$16,$B$9=$C$16,$B$10=$C$16,$B$11=$C$16,$B$12=$C$16,$B$13=$C$16,$B$14=$C$16),$C$27=$G$18),M4,\"\")","v":""},{"$f":"IF(AND(OR($B$3=$C$16,AND($B$9=$C$16,$E$3=$C$16),$B$10=$C$16,$B$11=$C$16,$B$12=$C$16,$B$13=$C$16,$B$14=$C$16),OR($C$27=$G$19,$C$27=$G$18)),N4,\"\")","v":""},{"$f":"IF(AND(OR($B$3=$C$16,AND($B$9=$C$16,$E$3=$C$16),$B$10=$C$16,$B$11=$C$16,$B$12=$C$16,$B$13=$C$16,$B$14=$C$16),OR($C$27=$G$19,$C$27=$G$18)),O4,\"\")","v":""},{"$f":"IF(AND(OR($B$3=$C$16,AND($B$9=$C$16,$E$3=$C$16),$B$10=$C$16,$B$11=$C$16,$B$12=$C$16,$B$13=$C$16,$B$14=$C$16),OR($C$27=$G$19,$C$27=$G$18)),P4,\"\")","v":""},{"$f":"SEARCH(\"760\",B30)","v":{"$error":"#VALUE!"}},{"$f":"ISNUMBER(H30)","v":false},null,760240492,"FACT-3ELHPSFS","Left hand patch SC/UPC Grade B",760240494,"FACT-3ELHPLFS","Left hand patch LC/UPC Grade B",null,null,null,760240496,"FACT-3ELHPL5S"]
[1,{"$f":"IF(AND(OR($B$3=$C$16,$B$9=$C$16,$B$10=$C$16,$B$11=$C$16,$B$12=$C$16,$B$13=$C$16,$B$14=$C$16),$C$27=$G$18),K6,\"\")","v":""},{"$f":"IF(AND(OR($B$3=$C$16,$B$9=$C$16,$B$10=$C$16,$B$11=$C$16,$B$12=$C$16,$B$13=$C$16,$B$14=$C$16),$C$27=$G$18),L6,\"\")","v":""},{"$f":"IF(AND(OR($B$3=$C$16,$B$9=$C$16,$B$10=$C$16,$B$11=$C$16,$B$12=$C$16,$B$13=$C$16,$B$14=$C$16),$C$27=$G$18),M5,\"\")","v":""},"","","",{"$error":"#VALUE!"},false]
[1,{"$f":"IF(AND(OR($B$3=$C$16,$B$9=$C$16,$B$10=$C$16,$B$11=$C$16,$B$12=$C$16,$B$13=$C$16,$B$14=$C$16),$C$27=$G$18),K5,\"\")","v":""},{"$f":"IF(AND(OR($B$3=$C$16,$B$9=$C$16,$B$10=$C$16,$B$11=$C$16,$B$12=$C$16,$B$13=$C$16,$B$14=$C$16),$C$27=$G$18),L5,\"\")","v":""},{"$f":"IF(AND(OR($B$3=$C$16,$B$9=$C$16,$B$10=$C$16,$B$11=$C$16,$B$12=$C$16,$B$13=$C$16,$B$14=$C$16),$C$27=$G$18),M6,\"\")","v":""},"","","",{"$error":"#VALUE!"},false,null,760240079,"FACT-4ERHPS2S","Right hand patch SC/APC Grade C",760240056,"FACT-4ERHPL2S","Right hand patch LC/APC Grade C",760240517,"FACT-4ELHPE9S",null,760240015,"FACT-4ELHPL4S"]
[1,"","","","","","",{"$error":"#VALUE!"},false,null,760240052,"FACT-4ERHPS1S","Right hand patch SC/UPC Grade C",760240055,"FACT-4ERHPL1S","Right hand patch LC/UPC Grade C",760240651,"FACT-4ERHPE9S",null,760240057,"FACT-4ERHPL4S"]
[1,"","","","","","",{"$error":"#VALUE!"},false,null,760240645,"FACT-4ERHPSGS","Right hand patch SC/APC Grade B",760240649,"FACT-4ERHPLGS","Right hand patch LC/APC Grade B",760249888,"FACT-4ELHPECS",null,760240512,"FACT-4ELHPS4S"]
[1,{"$f":"IF(AND(OR($B$3=$C$16,$B$9=$C$16,$B$10=$C$16,$B$11=$C$16,$B$12=$C$16,$B$13=$C$16,$B$14=$C$16),$C$27=$G$18),K10,\"\")","v":""},{"$f":"IF(AND(OR($B$3=$C$16,$B$9=$C$16,$B$10=$C$16,$B$11=$C$16,$B$12=$C$16,$B$13=$C$16,$B$14=$C$16),$C$27=$G$18),L10,\"\")","v":""},"","","","",{"$error":"#VALUE!"},false,null,760240644,"FACT-4ERHPSFS","Right hand patch SC/UPC Grade B",760240648,"FACT-4ERHPLFS","Right hand patch LC/UPC Grade B",760249899,"FACT-4ERHPECS",null,760240513,"FACT-4ELHPS5S"]
[1,{"$f":"IF(AND(OR($B$3=$C$16,$B$9=$C$16,$B$10=$C$16,$B$11=$C$16,$B$12=$C$16,$B$13=$C$16,$B$14=$C$16),$C$27=$G$18),K9,\"\")","v":""},{"$f":"IF(AND(OR($B$3=$C$16,$B$9=$C$16,$B$10=$C$16,$B$11=$C$16,$B$12=$C$16,$B$13=$C$16,$B$14=$C$16),$C$27=$G$18),L9,\"\")","v":""},"","","","",{"$error":"#VALUE!"},false,null,760240099,"FACT-4ELHPS2S","Left hand patch SC/APC Grade C",760240014,"FACT-4ELHPL2S","Left hand patch LC/APC Grade C",null,null,null,760240516,"FACT-4ELHPL5S"]
[2,{"$f":"IF(AND(OR($B$4=$C$16,$B$11=$C$16,$B$12=$C$16,$B$14=$C$16),$C$27=$G$19),K12,\"\")","v":""},{"$f":"IF(AND(OR($B$4=$C$16,$B$11=$C$16,$B$12=$C$16,$B$14=$C$16),$C$27=$G$19),L12,\"\")","v":""},"",{"$f":"IF(AND(OR($B$4=$C$16,$B$11=$C$16,$B$12=$C$16,$B$14=$C$16),OR($C$27=$G$20,$C$27=$G$21)),N12,\"\")","v":""},{"$f":"IF(AND(OR($B$4=$C$16,$B$11=$C$16,$B$12=$C$16,$B$14=$C$16),OR($C$27=$G$20,$C$27=$G$21)),O12,\"\")","v":""},"",{"$error":"#VALUE!"},false,null,760240509,"FACT-4ELHPS1S","Left hand patch SC/UPC Grade C",760240013,"FACT-4ELHPL1S","Left hand patch LC/UPC Grade C",null,null,null,760240646,"FACT-4ERHPS4S"]
[2,{"$f":"IF(AND(OR($B$4=$C$16,$B$11=$C$16,$B$12=$C$16,$B$14=$C$16),$C$27=$G$19),K13,\"\")","v":""},{"$f":"IF(AND(OR($B$4=$C$16,$B$11=$C$16,$B$12=$C$16,$B$14=$C$16),$C$27=$G$19),L13,\"\")","v":""},{"$f":"IF(AND(OR($B$4=$C$16,$B$11=$C$16,$B$12=$C$16,$B$14=$C$16),$C$27=$G$19),M13,\"\")","v":""},{"$f":"IF(AND(OR($B$4=$C$16,$B$11=$C$16,$B$12=$C$16,$B$14=$C$16),OR($C$27=$G$20,$C$27=$G$21)),N13,\"\")","v":""},{"$f":"IF(AND(OR($B$4=$C$16,$B$11=$C$16,$B$12=$C$16,$B$14=$C$16),OR($C$27=$G$20,$C$27=$G$21)),O13,\"\")","v":""},{"$f":"IF(AND(OR($B$4=$C$16,$B$11=$C$16,$B$12=$C$16,$B$14=$C$16),OR($C$27=$G$20,$C$27=$G$21)),P13,\"\")","v":""},{"$error":"#VALUE!"},false,null,760240511,"FACT-4ELHPSGS","Left hand patch SC/APC Grade B",760240515,"FACT-4ELHPLGS","Left hand patch LC/APC Grade B",null,null,null,760240647,"FACT-4ERHPS5S"]
[2,{"$f":"IF(AND(OR($B$4=$C$16,$B$11=$C$16,$B$12=$C$16,$B$14=$C$16),$C$27=$G$19),K15,\"\")","v":""},{"$f":"IF(AND(OR($B$4=$C$16,$B$11=$C$16,$B$12=$C$16,$B$14=$C$16),$C$27=$G$19),L15,\"\")","v":""},"","","","",{"$error":"#VALUE!"},false,null,760240510,"FACT-4ELHPSFS","Left hand patch SC/UPC Grade B",760240514,"FACT-4ELHPLFS","Left hand patch LC/UPC Grade B",null,null,null,760240650,"FACT-4ERHPL5S"]
[2,{"$f":"IF(AND(OR($B$4=$C$16,$B$11=$C$16,$B$12=$C$16,$B$14=$C$16),$C$27=$G$19),K14,\"\")","v":""},{"$f":"IF(AND(OR($B$4=$C$16,$B$11=$C$16,$B$12=$C$16,$B$14=$C$16),$C$27=$G$19),L14,\"\")","v":""},"","","","",{"$error":"#VALUE!"},false]
[2,"","","","","","",{"$error":"#VALUE!"},false,null,760240664,"FACT-5ERHPS2S","Right hand patch SC/APC Grade C",760240670,"FACT-5ERHPL2S","Right hand patch LC/APC Grade C",760240542,"FACT-5ELHPE9S",null,760240534,"FACT-5ELHPS4S"]
[2,"","","","","","",{"$error":"#VALUE!"},false,null,760240663,"FACT-5ERHPS1S","Right hand patch SC/UPC Grade C",760240669,"FACT-5ERHPL1S","Right hand patch LC/UPC Grade C",760240675,"FACT-5ERHPE9S",null,760240535,"FACT-5ELHPS5S"]
[2,{"$f":"IF(AND(OR($B$4=$C$16,$B$11=$C$16,$B$12=$C$16,$B$14=$C$16),$C$27=$G$19),K19,\"\")","v":""},{"$f":"IF(AND(OR($B$4=$C$16,$B$11=$C$16,$B$12=$C$16,$B$14=$C$16),$C$27=$G$19),L19,\"\")","v":""},"","","","",{"$error":"#VALUE!"},false,null,760240666,"FACT-5ERHPSGS","Right hand patch SC/APC Grade B",760240672,"FACT-5ERHPLGS","Right hand patch LC/APC Grade B",760249890,"FACT-5ELHPECS",null,760240540,"FACT-5ELHPL4S"]
[2,{"$f":"IF(AND(OR($B$4=$C$16,$B$11=$C$16,$B$12=$C$16,$B$14=$C$16),$C$27=$G$19),K18,\"\")","v":""},{"$f":"IF(AND(OR($B$4=$C$16,$B$11=$C$16,$B$12=$C$16,$B$14=$C$16),$C$27=$G$19),L18,\"\")","v":""},"","","","",{"$error":"#VALUE!"},false,null,760240665,"FACT-5ERHPSFS","Right hand patch SC/UPC Grade B",760240671,"FACT-5ERHPLFS","Right hand patch LC/UPC Grade B",760249901,"FACT-5ERHPECS",null,760240541,"FACT-5ELHPL5S"]
[3,{"$f":"IF(AND(OR($B$5=$C$16,$B$11=$C$16,$B$12=$C$16,$B$14=$C$16),$C$27=$G$20),K23,\"\")","v":""},{"$f":"IF(AND(OR($B$5=$C$16,$B$11=$C$16,$B$12=$C$16,$B$14=$C$16),$C$27=$G$20),L23,\"\")","v":""},"",{"$f":"IF(AND(OR($B$5=$C$16,$B$11=$C$16,$B$12=$C$16,$B$14=$C$16),OR($C$27=$G$22,$C$27=$G$23)),N23,\"\")","v":""},{"$f":"IF(AND(OR($B$5=$C$16,$B$11=$C$16,$B$12=$C$16,$B$14=$C$16),OR($C$27=$G$22,$C$27=$G$23)),O23,\"\")","v":""},"",{"$error":"#VALUE!"},false,null,760240531,"FACT-5ELHPS2S","Left hand patch SC/APC Grade C",760240537,"FACT-5ELHPL2S","Left hand patch LC/APC Grade C",null,null,null,760240667,"FACT-5ERHPS4S"]
[3,{"$f":"IF(AND(OR($B$5=$C$16,$B$11=$C$16,$B$12=$C$16,$B$14=$C$16),$C$27=$G$20),K24,\"\")","v":""},{"$f":"IF(AND(OR($B$5=$C$16,$B$11=$C$16,$B$12=$C$16,$B$14=$C$16),$C$27=$G$20),L24,\"\")","v":""},{"$f":"IF(AND(OR($B$5=$C$16,$B$11=$C$16,$B$12=$C$16,$B$14=$C$16),$C$27=$G$20),M24,\"\")","v":""},{"$f":"IF(AND(OR($B$5=$C$16,$B$11=$C$16,$B$12=$C$16,$B$14=$C$16),OR($C$27=$G$22,$C$27=$G$23)),N24,\"\")","v":""},{"$f":"IF(AND(OR($B$5=$C$16,$B$11=$C$16,$B$12=$C$16,$B$14=$C$16),OR($C$27=$G$22,$C$27=$G$23)),O24,\"\")","v":""},{"$f":"IF(AND(OR($B$5=$C$16,$B$11=$C$16,$B$12=$C$16,$B$14=$C$16),OR($C$27=$G$22,$C$27=$G$23)),P24,\"\")","v":""},{"$error":"#VALUE!"},false,null,760240530,"FACT-5ELHPS1S","Left hand patch SC/UPC Grade C",760240536,"FACT-5ELHPL1S","Left hand patch LC/UPC Grade C",null,null,null,760240668,"FACT-5ERHPS5S"]
[3,"","","","","","",{"$error":"#VALUE!"},false,null,760240533,"FACT-5ELHPSGS","Left hand patch SC/APC Grade B",760240539,"FACT-5ELHPLGS","Left hand patch LC/APC Grade B",null,null,null,760240673,"FACT-5ERHPL4S"]
[3,"","","","",{"$f":"IF(AND(OR($B$5=$C$16,$B$11=$C$16,$B$12=$C$16,$B$14=$C$16),OR($C$27=$G$22,$C$27=$G$23)),O26,\"\")","v":""},{"$f":"IF(AND(OR($B$5=$C$16,$B$11=$C$16,$B$12=$C$16,$B$14=$C$16),OR($C$27=$G$22,$C$27=$G$23)),P26,\"\")","v":""},{"$error":"#VALUE!"},false,null,760240532,"FACT-5ELHPSFS","Left hand patch SC/UPC Grade B",760240538,"FACT-5ELHPLFS","Left hand patch LC/UPC Grade B",null,null,null,760240674,"FACT-5ERHPL5S"]
[3,"","","","","","",{"$error":"#VALUE!"},false]
[3,"","","","","","",{"$error":"#VALUE!"},false,null,760240689,"FACT-6ERHPS2S","Right hand patch SC/APC Grade C",760240061,"FACT-6ERHPL2S","Right hand patch LC/APC Grade C",760240568,"FACT-6ELHPE9S",null,760240560,"FACT-6ELHPS4S"]
[3,{"$f":"IF(AND(OR($B$5=$C$16,$B$11=$C$16,$B$12=$C$16,$B$14=$C$16),$C$27=$G$20),K30,\"\")","v":""},{"$f":"IF(AND(OR($B$5=$C$16,$B$11=$C$16,$B$12=$C$16,$B$14=$C$16),$C$27=$G$20),L30,\"\")","v":""},"","","",{"$f":"IF(AND(OR($B$5=$C$16,$B$11=$C$16,$B$12=$C$16,$B$14=$C$16),OR($C$27=$G$22,$C$27=$G$23)),P29,\"\")","v":""},{"$error":"#VALUE!"},false,null,760240060,"FACT-6ERHPS1S","Right hand patch SC/UPC Grade C",760240694,"FACT-6ERHPL1S","Right hand patch LC/UPC Grade C",760240699,"FACT-6ERHPE9S",null,760240561,"FACT-6ELHPS5S"]
[3,{"$f":"IF(AND(OR($B$5=$C$16,$B$11=$C$16,$B$12=$C$16,$B$14=$C$16),$C$27=$G$20),K29,\"\")","v":""},{"$f":"IF(AND(OR($B$5=$C$16,$B$11=$C$16,$B$12=$C$16,$B$14=$C$16),$C$27=$G$20),L29,\"\")","v":""},"","","","",{"$error":"#VALUE!"},false,null,760240691,"FACT-6ERHPSGS","Right hand patch SC/APC Grade B",760240696,"FACT-6ERHPLGS","Right hand patch LC/APC Grade B",760249892,"FACT-6ELHPECS",null,760240566,"FACT-6ELHPL4S"]
[4,{"$f":"IF(AND(OR($B$6=$C$16,$B$11=$C$16,$B$14=$C$16),$C$27=$G$21),K32,\"\")","v":""},{"$f":"IF(AND(OR($B$6=$C$16,$B$11=$C$16,$B$14=$C$16),$C$27=$G$21),L32,\"\")","v":""},"",{"$f":"IF(AND(OR($B$6=$C$16,$B$11=$C$16,$B$12=$C$16,$B$14=$C$16),$C$27=$G$24),N32,\"\")","v":""},{"$f":"IF(AND(OR($B$6=$C$16,$B$11=$C$16,$B$12=$C$16,$B$14=$C$16),$C$27=$G$24),O32,\"\")","v":""},"",{"$error":"#VALUE!"},false,null,760240690,"FACT-6ERHPSFS","Right hand patch SC/UPC Grade B",760240695,"FACT-6ERHPLFS","Right hand patch LC/UPC Grade B",760249903,"FACT-6ERHPECS",null,760240567,"FACT-6ELHPL5S"]
[4,{"$f":"IF(AND(OR($B$6=$C$16,$B$11=$C$16,$B$14=$C$16),$C$27=$G$21),K33,\"\")","v":""},{"$f":"IF(AND(OR($B$6=$C$16,$B$11=$C$16,$B$14=$C$16),$C$27=$G$21),L33,\"\")","v":""},{"$f":"IF(AND(OR($B$6=$C$16,$B$11=$C$16,$B$14=$C$16),$C$27=$G$21),M33,\"\")","v":""},{"$f":"IF(AND(OR($B$6=$C$16,$B$11=$C$16,$B$12=$C$16,$B$14=$C$16),$C$27=$G$24),N33,\"\")","v":""},{"$f":"IF(AND(OR($B$6=$C$16,$B$11=$C$16,$B$12=$C$16,$B$14=$C$16),$C$27=$G$24),O33,\"\")","v":""},{"$f":"IF(AND(OR($B$6=$C$16,$B$11=$C$16,$B$12=$C$16,$B$14=$C$16),$C$27=$G$24),P33,\"\")","v":""},{"$error":"#VALUE!"},false,null,760240557,"FACT-6ELHPS2S","Left hand patch SC/APC Grade C",760240563,"FACT-6ELHPL2S","Left hand patch LC/APC Grade C",null,null,null,760240692,"FACT-6ERHPS4S"]
[4,{"$f":"IF(AND(OR($B$6=$C$16,$B$11=$C$16,$B$14=$C$16),$C$27=$G$21),K35,\"\")","v":""},{"$f":"IF(AND(OR($B$6=$C$16,$B$11=$C$16,$B$14=$C$16),$C$27=$G$21),L35,\"\")","v":""},"","","","",{"$error":"#VALUE!"},false,null,760240556,"FACT-6ELHPS1S","Left hand patch SC/UPC Grade C",760240562,"FACT-6ELHPL1S","Left hand patch LC/UPC Grade C",null,null,null,760240693,"FACT-6ERHPS5S"]
[4,{"$f":"IF(AND(OR($B$6=$C$16,$B$11=$C$16,$B$14=$C$16),$C$27=$G$21),K34,\"\")","v":""},{"$f":"IF(AND(OR($B$6=$C$16,$B$11=$C$16,$B$14=$C$16),$C$27=$G$21),L34,\"\")","v":""},"","","","",{"$error":"#VALUE!"},false,null,760240559,"FACT-6ELHPSGS","Left hand patch SC/APC Grade B",760240565,"FACT-6ELHPLGS","Left hand patch LC/APC Grade B",null,null,null,760240697,"FACT-6ERHPL4S"]
[4,"","","","","","",{"$error":"#VALUE!"},false,null,760240558,"FACT-6ELHPSFS","Left hand patch SC/UPC Grade B",760240564,"FACT-6ELHPLFS","Left hand patch LC/UPC Grade B",null,null,null,760240698,"FACT-6ERHPL5S"]
[4,"","","","","","",{"$error":"#VALUE!"},false]
[4,{"$f":"IF(AND(OR($B$6=$C$16,$B$11=$C$16,$B$14=$C$16),$C$27=$G$21),K39,\"\")","v":""},{"$f":"IF(AND(OR($B$6=$C$16,$B$11=$C$16,$B$14=$C$16),$C$27=$G$21),L39,\"\")","v":""},"","","","",{"$error":"#VALUE!"},false]
[4,{"$f":"IF(AND(OR($B$6=$C$16,$B$11=$C$16,$B$14=$C$16),$C$27=$G$21),K38,\"\")","v":""},{"$f":"IF(AND(OR($B$6=$C$16,$B$11=$C$16,$B$14=$C$16),$C$27=$G$21),L38,\"\")","v":""},"","","","",{"$f":"SEARCH(\"760\",B60)","v":{"$error":"#VALUE!"}},false]
[5,{"$f":"IF(AND(OR($B$7=$C$16,$B$11=$C$16,$B$14=$C$16),$C$27=$G$22),K41,\"\")","v":""},{"$f":"IF(AND(OR($B$7=$C$16,$B$11=$C$16,$B$14=$C$16),$C$27=$G$22),L41,\"\")","v":""},"",{"$f":"IF(AND(OR($B$7=$C$16,$B$11=$C$16,$B$14=$C$16),OR($C$27=$G$24,$C$27=$G$25)),N41,\"\")","v":""},{"$f":"IF(AND(OR($B$7=$C$16,$B$11=$C$16,$B$14=$C$16),OR($C$27=$G$24,$C$27=$G$25)),O41,\"\")","v":""},"",{"$error":"#VALUE!"},false]
[5,{"$f":"IF(AND(OR($B$7=$C$16,$B$11=$C$16,$B$14=$C$16),$C$27=$G$22),K42,\"\")","v":""},{"$f":"IF(AND(OR($B$7=$C$16,$B$11=$C$16,$B$14=$C$16),$C$27=$G$22),L42,\"\")","v":""},{"$f":"IF(AND(OR($B$7=$C$16,$B$11=$C$16,$B$14=$C$16),$C$27=$G$22),M42,\"\")","v":""},{"$f":"IF(AND(OR($B$7=$C$16,$B$11=$C$16,$B$14=$C$16),OR($C$27=$G$24,$C$27=$G$25)),N42,\"\")","v":""},{"$f":"IF(AND(OR($B$7=$C$16,$B$11=$C$16,$B$14=$C$16),OR($C$27=$G$24,$C$27=$G$25)),O42,\"\")","v":""},{"$f":"IF(AND(OR($B$7=$C$16,$B$11=$C$16,$B$14=$C$16),OR($C$27=$G$24,$C$27=$G$25)),P42,\"\")","v":""},{"$error":"#VALUE!"},false]
[5,{"$f":"IF(AND(OR($B$7=$C$16,$B$11=$C$16,$B$14=$C$16),$C$27=$G$22),K44,\"\")","v":""},{"$f":"IF(AND(OR($B$7=$C$16,$B$11=$C$16,$B$14=$C$16),$C$27=$G$22),L44,\"\")","v":""},"","","","",{"$error":"#VALUE!"},false]
[5,{"$f":"IF(AND(OR($B$7=$C$16,$B$11=$C$16,$B$14=$C$16),$C$27=$G$22),K43,\"\")","v":""},{"$f":"IF(AND(OR($B$7=$C$16,$B$11=$C$16,$B$14=$C$16),$C$27=$G$22),L43,\"\")","v":""},"","","","",{"$error":"#VALUE!"},false]
[5,"","","","","","",{"$error":"#VALUE!"},false]
[5,"","","","","","",{"$error":"#VALUE!"},false]
[5,{"$f":"IF(AND(OR($B$7=$C$16,$B$11=$C$16,$B$14=$C$16),$C$27=$G$22),K48,\"\")","v":""},{"$f":"IF(AND(OR($B$7=$C$16,$B$11=$C$16,$B$14=$C$16),$C$27=$G$22),L48,\"\")","v":""},"","","","",{"$error":"#VALUE!"},false]
[5,{"$f":"IF(AND(OR($B$7=$C$16,$B$11=$C$16,$B$14=$C$16),$C$27=$G$22),K47,\"\")","v":""},{"$f":"IF(AND(OR($B$7=$C$16,$B$11=$C$16,$B$14=$C$16),$C$27=$G$22),L47,\"\")","v":""},"","","",{"$f":"IF(AND(OR($B$7=$C$16,$B$11=$C$16,$B$14=$C$16),OR($C$27=$G$24,$C$27=$G$25)),P48,\"\")","v":""},{"$error":"#VALUE!"},false]
[6,{"$f":"IF(AND(OR($B$8=$C$16,$B$11=$C$16,$B$14=$C$16),$C$27=$G$23),K50,\"\")","v":""},{"$f":"IF(AND(OR($B$8=$C$16,$B$11=$C$16,$B$14=$C$16),$C$27=$G$23),L50,\"\")","v":""},"",{"$f":"IF(AND(OR($B$8=$C$16,$B$11=$C$16,$B$14=$C$16),$C$27=$G$26),N50,\"\")","v":""},{"$f":"IF(AND(OR($B$8=$C$16,$B$11=$C$16,$B$14=$C$16),$C$27=$G$26),O50,\"\")","v":""},"",{"$error":"#VALUE!"},false]
[6,{"$f":"IF(AND(OR($B$8=$C$16,$B$11=$C$16,$B$14=$C$16),$C$27=$G$23),K51,\"\")","v":""},{"$f":"IF(AND(OR($B$8=$C$16,$B$11=$C$16,$B$14=$C$16),$C$27=$G$23),L51,\"\")","v":""},{"$f":"IF(AND(OR($B$8=$C$16,$B$11=$C$16,$B$14=$C$16),$C$27=$G$23),M51,\"\")","v":""},{"$f":"IF(AND(OR($B$8=$C$16,$B$11=$C$16,$B$14=$C$16),$C$27=$G$26),N51,\"\")","v":""},{"$f":"IF(AND(OR($B$8=$C$16,$B$11=$C$16,$B$14=$C$16),$C$27=$G$26),O51,\"\")","v":""},{"$f":"IF(AND(OR($B$8=$C$16,$B$11=$C$16,$B$14=$C$16),$C$27=$G$26),P51,\"\")","v":""},{"$error":"#VALUE!"},false]
[6,{"$f":"IF(AND(OR($B$8=$C$16,$B$11=$C$16,$B$14=$C$16),$C$27=$G$23),K53,\"\")","v":""},{"$f":"IF(AND(OR($B$8=$C$16,$B$11=$C$16,$B$14=$C$16),$C$27=$G$23),L53,\"\")","v":""},"","","","",{"$error":"#VALUE!"},false]
[6,{"$f":"IF(AND(OR($B$8=$C$16,$B$11=$C$16,$B$14=$C$16),$C$27=$G$23),K52,\"\")","v":""},{"$f":"IF(AND(OR($B$8=$C$16,$B$11=$C$16,$B$14=$C$16),$C$27=$G$23),L52,\"\")","v":""},"","","","",{"$error":"#VALUE!"},false]
[6,"","","","","","",{"$error":"#VALUE!"},false]
[6,"","","","","","",{"$error":"#VALUE!"},false]
[6,{"$f":"IF(AND(OR($B$8=$C$16,$B$11=$C$16,$B$14=$C$16),$C$27=$G$23),K57,\"\")","v":""},{"$f":"IF(AND(OR($B$8=$C$16,$B$11=$C$16,$B$14=$C$16),$C$27=$G$23),L57,\"\")","v":""},"","","","",{"$error":"#VALUE!"},false]
[6,{"$f":"IF(AND(OR($B$8=$C$16,$B$11=$C$16,$B$14=$C$16),$C$27=$G$23),K56,\"\")","v":""},{"$f":"IF(AND(OR($B$8=$C$16,$B$11=$C$16,$B$14=$C$16),$C$27=$G$23),L56,\"\")","v":""},"","","","",{"$error":"#VALUE!"},false]
["6x7"]
[]
[]
[null,{"$f":"_xlfn._xlws.FILTER(B29:D76,ISNUMBER(SEARCH(\"760\",B29:B76)),\"no match\")","v":"no match"},null,null,{"$f":"_xlfn._xlws.FILTER(E29:G76,ISNUMBER(SEARCH(\"760\",E29:E76)),\"no match\")","v":"no match"},null,null,null,null,{"$f":"_xlfn.IFS(AND($N$80=$C$17,$N$81=$C$17,$N$82=$C$17,$N$83=$C$17,$N$84=$C$17,$N$85=$C$17,$N$86=$C$17,$N$87=$C$17,$N$88=$C$17,$N$89=$C$17,$N$90=$C$17,$N$91=$C$17),$G$28,$D$3=$C$16,Sheet10!B80,$E$3=$C$16,Sheet10!E80)","v":""},{"$f":"_xlfn.IFS(AND($N$80=$C$17,$N$81=$C$17,$N$82=$C$17,$N$83=$C$17,$N$84=$C$17,$N$85=$C$17,$N$86=$C$17,$N$87=$C$17,$N$88=$C$17,$N$89=$C$17,$N$90=$C$17,$N$91=$C$17),$G$28,$D$3=$C$16,Sheet10!C80,$E$3=$C$16,Sheet10!F80)","v":""},{"$f":"_xlfn.IFS(AND($N$80=$C$17,$N$81=$C$17,$N$82=$C$17,$N$83=$C$17,$N$84=$C$17,$N$85=$C$17,$N$86=$C$17,$N$87=$C$17,$N$88=$C$17,$N$89=$C$17,$N$90=$C$17,$N$91=$C$17),$G$28,$D$3=$C$16,Sheet10!D80,$E$3=$C$16,Sheet10!G80)","v":""},null,{"$f":"Sheet1!D21","v":"nok"}]
[null,null,null,null,null,null,null,null,null,{"$f":"_xlfn.IFS(AND($N$80=$C$17,$N$81=$C$17,$N$82=$C$17,$N$83=$C$17,$N$84=$C$17,$N$85=$C$17,$N$86=$C$17,$N$87=$C$17,$N$88=$C$17,$N$89=$C$17,$N$90=$C$17,$N$91=$C$17),$G$28,$D$3=$C$16,Sheet10!B81,$E$3=$C$16,Sheet10!E81)","v":""},{"$f":"_xlfn.IFS(AND($N$80=$C$17,$N$81=$C$17,$N$82=$C$17,$N$83=$C$17,$N$84=$C$17,$N$85=$C$17,$N$86=$C$17,$N$87=$C$17,$N$88=$C$17,$N$89=$C$17,$N$90=$C$17,$N$91=$C$17),$G$28,$D$3=$C$16,Sheet10!C81,$E$3=$C$16,Sheet10!F81)","v":""},{"$f":"_xlfn.IFS(AND($N$80=$C$17,$N$81=$C$17,$N$82=$C$17,$N$83=$C$17,$N$84=$C$17,$N$85=$C$17,$N$86=$C$17,$N$87=$C$17,$N$88=$C$17,$N$89=$C$17,$N$90=$C$17,$N$91=$C$17),$G$28,$D$3=$C$16,Sheet10!D81,$E$3=$C$16,Sheet10!G81)","v":""},null,{"$f":"Sheet1!D22","v":"nok"}]
[null,null,null,null,null,null,null,null,null,{"$f":"_xlfn.IFS(AND($N$80=$C$17,$N$81=$C$17,$N$82=$C$17,$N$83=$C$17,$N$84=$C$17,$N$85=$C$17,$N$86=$C$17,$N$87=$C$17,$N$88=$C$17,$N$89=$C$17,$N$90=$C$17,$N$91=$C$17),$G$28,$D$3=$C$16,Sheet10!B82,$E$3=$C$16,Sheet10!E82)","v":""},{"$f":"_xlfn.IFS(AND($N$80=$C$17,$N$81=$C$17,$N$82=$C$17,$N$83=$C$17,$N$84=$C$17,$N$85=$C$17,$N$86=$C$17,$N$87=$C$17,$N$88=$C$17,$N$89=$C$17,$N$90=$C$17,$N$91=$C$17),$G$28,$D$3=$C$16,Sheet10!C82,$E$3=$C$16,Sheet10!F82)","v":""},{"$f":"_xlfn.IFS(AND($N$80=$C$17,$N$81=$C$17,$N$82=$C$17,$N$83=$C$17,$N$84=$C$17,$N$85=$C$17,$N$86=$C$17,$N$87=$C$17,$N$88=$C$17,$N$89=$C$17,$N$90=$C$17,$N$91=$C$17),$G$28,$D$3=$C$16,Sheet10!D82,$E$3=$C$16,Sheet10!G82)","v":""},null,{"$f":"Sheet1!D23","v":"nok"}]
[null,null,null,null,null,null,null,null,null,{"$f":"_xlfn.IFS(AND($N$80=$C$17,$N$81=$C$17,$N$82=$C$17,$N$83=$C$17,$N$84=$C$17,$N$85=$C$17,$N$86=$C$17,$N$87=$C$17,$N$88=$C$17,$N$89=$C$17,$N$90=$C$17,$N$91=$C$17),$G$28,$D$3=$C$16,Sheet10!B83,$E$3=$C$16,Sheet10!E83)","v":""},{"$f":"_xlfn.IFS(AND($N$80=$C$17,$N$81=$C$17,$N$82=$C$17,$N$83=$C$17,$N$84=$C$17,$N$85=$C$17,$N$86=$C$17,$N$87=$C$17,$N$88=$C$17,$N$89=$C$17,$N$90=$C$17,$N$91=$C$17),$G$28,$D$3=$C$16,Sheet10!C83,$E$3=$C$16,Sheet10!F83)","v":""},{"$f":"_xlfn.IFS(AND($N$80=$C$17,$N$81=$C$17,$N$82=$C$17,$N$83=$C$17,$N$84=$C$17,$N$85=$C$17,$N$86=$C$17,$N$87=$C$17,$N$88=$C$17,$N$89=$C$17,$N$90=$C$17,$N$91=$C$17),$G$28,$D$3=$C$16,Sheet10!D83,$E$3=$C$16,Sheet10!G83)","v":""},null,{"$f":"Sheet1!D24","v":"nok"}]
["SLT",null,null,null,null,null,null,null,null,{"$f":"_xlfn.IFS(AND($N$80=$C$17,$N$81=$C$17,$N$82=$C$17,$N$83=$C$17,$N$84=$C$17,$N$85=$C$17,$N$86=$C$17,$N$87=$C$17,$N$88=$C$17,$N$89=$C$17,$N$90=$C$17,$N$91=$C$17),$G$28,$D$3=$C$16,Sheet10!B84,$E$3=$C$16,Sheet10!E84)","v":""},{"$f":"_xlfn.IFS(AND($N$80=$C$17,$N$81=$C$17,$N$82=$C$17,$N$83=$C$17,$N$84=$C$17,$N$85=$C$17,$N$86=$C$17,$N$87=$C$17,$N$88=$C$17,$N$89=$C$17,$N$90=$C$17,$N$91=$C$17),$G$28,$D$3=$C$16,Sheet10!C84,$E$3=$C$16,Sheet10!F84)","v":""},{"$f":"_xlfn.IFS(AND($N$80=$C$17,$N$81=$C$17,$N$82=$C$17,$N$83=$C$17,$N$84=$C$17,$N$85=$C$17,$N$86=$C$17,$N$87=$C$17,$N$88=$C$17,$N$89=$C$17,$N$90=$C$17,$N$91=$C$17),$G$28,$D$3=$C$16,Sheet10!D84,$E$3=$C$16,Sheet10!G84)","v":""},null,{"$f":"Sheet1!D25","v":"nok"}]
["MLT",null,null,null,null,null,null,null,null,{"$f":"_xlfn.IFS(AND($N$80=$C$17,$N$81=$C$17,$N$82=$C$17,$N$83=$C$17,$N$84=$C$17,$N$85=$C$17,$N$86=$C$17,$N$87=$C$17,$N$88=$C$17,$N$89=$C$17,$N$90=$C$17,$N$91=$C$17),$G$28,$D$3=$C$16,Sheet10!B85,$E$3=$C$16,Sheet10!E85)","v":""},{"$f":"_xlfn.IFS(AND($N$80=$C$17,$N$81=$C$17,$N$82=$C$17,$N$83=$C$17,$N$84=$C$17,$N$85=$C$17,$N$86=$C$17,$N$87=$C$17,$N$88=$C$17,$N$89=$C$17,$N$90=$C$17,$N$91=$C$17),$G$28,$D$3=$C$16,Sheet10!C85,$E$3=$C$16,Sheet10!F85)","v":""},{"$f":"_xlfn.IFS(AND($N$80=$C$17,$N$81=$C$17,$N$82=$C$17,$N$83=$C$17,$N$84=$C$17,$N$85=$C$17,$N$86=$C$17,$N$87=$C$17,$N$88=$C$17,$N$89=$C$17,$N$90=$C$17,$N$91=$C$17),$G$28,$D$3=$C$16,Sheet10!D85,$E$3=$C$16,Sheet10!G85)","v":""},null,{"$f":"Sheet1!D26","v":"nok"}]
["LLT",null,null,null,null,null,null,null,null,{"$f":"_xlfn.IFS(AND($N$80=$C$17,$N$81=$C$17,$N$82=$C$17,$N$83=$C$17,$N$84=$C$17,$N$85=$C$17,$N$86=$C$17,$N$87=$C$17,$N$88=$C$17,$N$89=$C$17,$N$90=$C$17,$N$91=$C$17),$G$28,$D$3=$C$16,Sheet10!B86,$E$3=$C$16,Sheet10!E86)","v":""},{"$f":"_xlfn.IFS(AND($N$80=$C$17,$N$81=$C$17,$N$82=$C$17,$N$83=$C$17,$N$84=$C$17,$N$85=$C$17,$N$86=$C$17,$N$87=$C$17,$N$88=$C$17,$N$89=$C$17,$N$90=$C$17,$N$91=$C$17),$G$28,$D$3=$C$16,Sheet10!C86,$E$3=$C$16,Sheet10!F86)","v":""},{"$f":"_xlfn.IFS(AND($N$80=$C$17,$N$81=$C$17,$N$82=$C$17,$N$83=$C$17,$N$84=$C$17,$N$85=$C$17,$N$86=$C$17,$N$87=$C$17,$N$88=$C$17,$N$89=$C$17,$N$90=$C$17,$N$91=$C$17),$G$28,$D$3=$C$16,Sheet10!D86,$E$3=$C$16,Sheet10!G86)","v":""},null,{"$f":"Sheet1!D27","v":"nok"}]
["SIFC",null,null,null,null,null,null,null,null,{"$f":"_xlfn.IFS(AND($N$80=$C$17,$N$81=$C$17,$N$82=$C$17,$N$83=$C$17,$N$84=$C$17,$N$85=$C$17,$N$86=$C$17,$N$87=$C$17,$N$88=$C$17,$N$89=$C$17,$N$90=$C$17,$N$91=$C$17),$G$28,$D$3=$C$16,Sheet10!B87,$E$3=$C$16,Sheet10!E87)","v":""},{"$f":"_xlfn.IFS(AND($N$80=$C$17,$N$81=$C$17,$N$82=$C$17,$N$83=$C$17,$N$84=$C$17,$N$85=$C$17,$N$86=$C$17,$N$87=$C$17,$N$88=$C$17,$N$89=$C$17,$N$90=$C$17,$N$91=$C$17),$G$28,$D$3=$C$16,Sheet10!C87,$E$3=$C$16,Sheet10!F87)","v":""},{"$f":"_xlfn.IFS(AND($N$80=$C$17,$N$81=$C$17,$N$82=$C$17,$N$83=$C$17,$N$84=$C$17,$N$85=$C$17,$N$86=$C$17,$N$87=$C$17,$N$88=$C$17,$N$89=$C$17,$N$90=$C$17,$N$91=$C$17),$G$28,$D$3=$C$16,Sheet10!D87,$E$3=$C$16,Sheet10!G87)","v":""},null,{"$f":"Sheet1!D28","v":"nok"}]
["MIFC",null,null,null,null,null,null,null,null,null,null,null,null,{"$f":"Sheet1!D29","v":"nok"}]
[null,null,null,null,null,null,null,null,null,null,null,null,null,{"$f":"Sheet1!D30","v":"nok"}]
[null,{"$f":"_xlfn._xlws.FILTER(B29:D76,ISNUMBER(SEARCH(\"760\",B29:B76)),\"no match\")","v":"no match"},null,null,null,null,null,null,null,null,null,null,null,{"$f":"Sheet1!D31","v":"nok"}]
[null,null,null,null,null,null,null,null,null,null,null,null,null,{"$f":"Sheet1!D32","v":"nok"}]

{"sheet":"1E-S","index":3,"n_rows":9,"n_cols":12,"rows_kept":9,"cut":false,"hidden":true,"merged":[]}
[]
[null,760240005,"FACT-1ERHPS2S","Right hand patch SC/APC Grade C","Right hand patch LC/APC Grade C",760240585,"FACT-1ERHPL1S",760240456,"FACT-1ELHPE9S",null,760240448,"FACT-1ELHPS4S"]
[null,760240018,"FACT-1ERHPS1S","Right hand patch SC/UPC Grade C","Right hand patch LC/UPC Grade C",760240586,"FACT-1ERHPL2S",760240591,"FACT-1ERHPE9S",null,760240449,"FACT-1ELHPS5S"]
[null,760240581,"FACT-1ERHPSFS","Right hand patch SC/APC Grade B","Right hand patch LC/APC Grade B",760240587,"FACT-1ERHPLFS",760249883,"FACT-1ELHPECS",null,760240583,"FACT-1ERHPS4S"]
[null,760240582,"FACT-1ERHPSGS","Right hand patch SC/UPC Grade B","Right hand patch LC/UPC Grade B",760240588,"FACT-1ERHPLGS",760249894,"FACT-1ERHPECS",null,760240584,"FACT-1ERHPS5S"]
[null,760240445,"FACT-1ELHPS2S","Left hand patch SC/APC Grade C","Left hand patch LC/APC Grade C",760240000,"FACT-1ELHPL2S",null,null,null,760240589,"FACT-1ERHPL4S"]
[null,760239999,"FACT-1ELHPS1S","Left hand patch SC/UPC Grade C","Left hand patch LC/UPC Grade C",760240450,"FACT-1ELHPL1S",null,null,null,760240590,"FACT-1ERHPL5S"]
[null,760240446,"FACT-1ELHPSFS","Left hand patch SC/APC Grade B","Left hand patch LC/APC Grade B",760240452,"FACT-1ELHPLFS",null,null,null,760240454,"FACT-1ELHPL4S"]
[null,760240447,"FACT-1ELHPSGS","Left hand patch SC/UPC Grade B","Left hand patch LC/UPC Grade B",760240453,"FACT-1ELHPLGS",null,null,null,760240455,"FACT-1ELHPL5S"]

{"sheet":"2E-S","index":4,"n_rows":11,"n_cols":12,"rows_kept":11,"cut":false,"hidden":true,"merged":[]}
[]
[null,760240605,"FACT-2ERHPS2S","Right hand patch SC/APC Grade C",760240021,"FACT-2ERHPL2S","Right hand patch LC/APC Grade C",760240478,"FACT-2ELHPE9S",null,760240473,"FACT-2ELHPS4S"]
[null,760240019,"FACT-2ERHPS1S","Right hand patch SC/UPC Grade C",760240020,"FACT-2ERHPL1S","Right hand patch LC/UPC Grade C",760240613,"FACT-2ERHPE9S",null,760240474,"FACT-2ELHPS5S"]
[null,760240606,"FACT-2ERHPSFS","Right hand patch SC/APC Grade B",760240610,"FACT-2ERHPLFS","Right hand patch LC/APC Grade B",760249885,"FACT-2ELHPECS",null,760240608,"FACT-2ERHPS4S"]
[null,760240607,"FACT-2ERHPSGS","Right hand patch SC/UPC Grade B",760240611,"FACT-2ERHPLGS","Right hand patch LC/UPC Grade B",760249896,"FACT-2ERHPECS",null,760240609,"FACT-2ERHPS5S"]
[null,760240470,"FACT-2ELHPS2S","Left hand patch SC/APC Grade C",760240002,"FACT-2ELHPL2S","Left hand patch LC/APC Grade C",null,null,null,760257256,"FACT-2ERHPS3S"]
[null,760240469,"FACT-2ELHPS1S","Left hand patch SC/UPC Grade C",760240001,"FACT-2ELHPL1S","Left hand patch LC/UPC Grade C",null,null,null,760240612,"FACT-2ERHPL5S"]
[null,760240471,"FACT-2ELHPSFS","Left hand patch SC/APC Grade B",760240475,"FACT-2ELHPLFS","Left hand patch LC/APC Grade B",null,null,null,760240003,"FACT-2ELHPL4S"]
[null,760240472,"FACT-2ELHPSGS","Left hand patch SC/UPC Grade B",760240476,"FACT-2ELHPLGS","Left hand patch LC/UPC Grade B",null,null,null,760240022,"FACT-2ERHPL4S"]
[null,null,null,null,null,null,null,null,null,null,760240477,"FACT-2ELHPL5S"]
[null,null,null,null,null,null,null,null,null,null,760257256,"FACT-2ERHPS3S"]

{"sheet":"3E-S","index":5,"n_rows":9,"n_cols":12,"rows_kept":9,"cut":false,"hidden":true,"merged":[]}
[]
[null,760240025,"FACT-3ERHPS1S","Right hand patch SC/APC Grade C",760240027,"FACT-3ERHPL1S","Right hand patch LC/APC Grade C",760240497,"FACT-3ELHPE9S",null,760240411,"FACT-3ELHPS5S"]
[null,760240074,"FACT-3ERHPS2S","Right hand patch SC/UPC Grade C",760240028,"FACT-3ERHPL2S","Right hand patch LC/UPC Grade C",760240632,"FACT-3ERHPE9S",null,760240493,"FACT-3ELHPS4S"]
[null,760240626,"FACT-3ERHPSGS","Right hand patch SC/APC Grade B",760240630,"FACT-3ERHPLGS","Right hand patch LC/APC Grade B",760249887,"FACT-3ELHPECS",null,760240627,"FACT-3ERHPS4S"]
[null,760240625,"FACT-3ERHPSFS","Right hand patch SC/UPC Grade B",760240629,"FACT-3ERHPLFS","Right hand patch LC/UPC Grade B",760249898,"FACT-3ERHPECS",null,760240628,"FACT-3ERHPS5S"]
[null,760240491,"FACT-3ELHPS1S","Left hand patch SC/APC Grade C",760240007,"FACT-3ELHPL1S","Left hand patch LC/APC Grade C",null,null,null,760240631,"FACT-3ERHPL5S"]
[null,760240075,"FACT-3ELHPS2S","Left hand patch SC/UPC Grade C",760240008,"FACT-3ELHPL2S","Left hand patch LC/UPC Grade C",null,null,null,760240029,"FACT-3ERHPL4S"]
[null,760240492,"FACT-3ELHPSFS","Left hand patch SC/APC Grade B",760240494,"FACT-3ELHPLFS","Left hand patch LC/APC Grade B",null,null,null,760240009,"FACT-3ELHPL4S"]
[null,760240006,"FACT-3ELHPSGS","Left hand patch SC/UPC Grade B",760240495,"FACT-3ELHPLGS","Left hand patch LC/UPC Grade B",null,null,null,760240496,"FACT-3ELHPL5S"]

{"sheet":"4E-S","index":6,"n_rows":9,"n_cols":12,"rows_kept":9,"cut":false,"hidden":true,"merged":[]}
[]
[null,760240079,"FACT-4ERHPS2S","Right hand patch SC/APC Grade C",760240056,"FACT-4ERHPL2S","Right hand patch LC/APC Grade C",760240517,"FACT-4ELHPE9S",null,760240015,"FACT-4ELHPL4S"]
[null,760240052,"FACT-4ERHPS1S","Right hand patch SC/UPC Grade C",760240055,"FACT-4ERHPL1S","Right hand patch LC/UPC Grade C",760240651,"FACT-4ERHPE9S",null,760240057,"FACT-4ERHPL4S"]
[null,760240644,"FACT-4ERHPSFS","Right hand patch SC/APC Grade B",760240648,"FACT-4ERHPLFS","Right hand patch LC/APC Grade B",760249888,"FACT-4ELHPECS",null,760240512,"FACT-4ELHPS4S"]
[null,760240645,"FACT-4ERHPSGS","Right hand patch SC/UPC Grade B",760240649,"FACT-4ERHPLGS","Right hand patch LC/UPC Grade B",760249899,"FACT-4ERHPECS",null,760240513,"FACT-4ELHPS5S"]
[null,760240099,"FACT-4ELHPS2S","Left hand patch SC/APC Grade C",760240014,"FACT-4ELHPL2S","Left hand patch LC/APC Grade C",null,null,null,760240516,"FACT-4ELHPL5S"]
[null,760240509,"FACT-4ELHPS1S","Left hand patch SC/UPC Grade C",760240013,"FACT-4ELHPL1S","Left hand patch LC/UPC Grade C",null,null,null,760240646,"FACT-4ERHPS4S"]
[null,760240510,"FACT-4ELHPSFS","Left hand patch SC/APC Grade B",760240514,"FACT-4ELHPLFS","Left hand patch LC/APC Grade B",null,null,null,760240647,"FACT-4ERHPS5S"]
[null,760240511,"FACT-4ELHPSGS","Left hand patch SC/UPC Grade B",760240515,"FACT-4ELHPLGS","Left hand patch LC/UPC Grade B",null,null,null,760240650,"FACT-4ERHPL5S"]

{"sheet":"5E-S","index":7,"n_rows":9,"n_cols":12,"rows_kept":9,"cut":false,"hidden":true,"merged":[]}
[]
[null,760240664,"FACT-5ERHPS2S","Right hand patch SC/APC Grade C",760240670,"FACT-5ERHPL2S","Right hand patch LC/APC Grade C",760240542,"FACT-5ELHPE9S",null,760240534,"FACT-5ELHPS4S"]
[null,760240663,"FACT-5ERHPS1S","Right hand patch SC/UPC Grade C",760240669,"FACT-5ERHPL1S","Right hand patch LC/UPC Grade C",760240675,"FACT-5ERHPE9S",null,760240535,"FACT-5ELHPS5S"]
[null,760240665,"FACT-5ERHPSFS","Right hand patch SC/APC Grade B",760240671,"FACT-5ERHPLFS","Right hand patch LC/APC Grade B",760249890,"FACT-5ELHPECS",null,760240540,"FACT-5ELHPL4S"]
[null,760240666,"FACT-5ERHPSGS","Right hand patch SC/UPC Grade B",760240672,"FACT-5ERHPLGS","Right hand patch LC/UPC Grade B",760249901,"FACT-5ERHPECS",null,760240541,"FACT-5ELHPL5S"]
[null,760240531,"FACT-5ELHPS2S","Left hand patch SC/APC Grade C",760240537,"FACT-5ELHPL2S","Left hand patch LC/APC Grade C",null,null,null,760240667,"FACT-5ERHPS4S"]
[null,760240530,"FACT-5ELHPS1S","Left hand patch SC/UPC Grade C",760240536,"FACT-5ELHPL1S","Left hand patch LC/UPC Grade C",null,null,null,760240668,"FACT-5ERHPS5S"]
[null,760240532,"FACT-5ELHPSFS","Left hand patch SC/APC Grade B",760240538,"FACT-5ELHPLFS","Left hand patch LC/APC Grade B",null,null,null,760240673,"FACT-5ERHPL4S"]
[null,760240533,"FACT-5ELHPSGS","Left hand patch SC/UPC Grade B",760240539,"FACT-5ELHPLGS","Left hand patch LC/UPC Grade B",null,null,null,760240674,"FACT-5ERHPL5S"]

{"sheet":"6E-S","index":8,"n_rows":9,"n_cols":12,"rows_kept":9,"cut":false,"hidden":true,"merged":[]}
[]
[null,760240689,"FACT-6ERHPS2S","Right hand patch SC/APC Grade C",760240061,"FACT-6ERHPL2S","Right hand patch LC/APC Grade C",760240568,"FACT-6ELHPE9S",null,760240560,"FACT-6ELHPS4S"]
[null,760240060,"FACT-6ERHPS1S","Right hand patch SC/UPC Grade C",760240694,"FACT-6ERHPL1S","Right hand patch LC/UPC Grade C",760240699,"FACT-6ERHPE9S",null,760240561,"FACT-6ELHPS5S"]
[null,760240690,"FACT-6ERHPSFS","Right hand patch SC/APC Grade B",760240695,"FACT-6ERHPLFS","Right hand patch LC/APC Grade B",760249892,"FACT-6ELHPECS",null,760240566,"FACT-6ELHPL4S"]
[null,760240691,"FACT-6ERHPSGS","Right hand patch SC/UPC Grade B",760240696,"FACT-6ERHPLGS","Right hand patch LC/UPC Grade B",760249903,"FACT-6ERHPECS",null,760240567,"FACT-6ELHPL5S"]
[null,760240557,"FACT-6ELHPS2S","Left hand patch SC/APC Grade C",760240563,"FACT-6ELHPL2S","Left hand patch LC/APC Grade C",null,null,null,760240692,"FACT-6ERHPS4S"]
[null,760240556,"FACT-6ELHPS1S","Left hand patch SC/UPC Grade C",760240562,"FACT-6ELHPL1S","Left hand patch LC/UPC Grade C",null,null,null,760240693,"FACT-6ERHPS5S"]
[null,760240558,"FACT-6ELHPSFS","Left hand patch SC/APC Grade B",760240564,"FACT-6ELHPLFS","Left hand patch LC/APC Grade B",null,null,null,760240697,"FACT-6ERHPL4S"]
[null,760240559,"FACT-6ELHPSGS","Left hand patch SC/UPC Grade B",760240565,"FACT-6ELHPLGS","Left hand patch LC/UPC Grade B",null,null,null,760240698,"FACT-6ERHPL5S"]